Phenacetin
- Formula: C10H13NO2
- Molecular weight: 179.2157
- IUPAC Standard InChIKey: CPJSUEIXXCENMM-UHFFFAOYSA-N
- CAS Registry Number: 62-44-2
- Chemical structure:
View 3d structure (requires JavaScript / HTML 5) - Other names: Acetamide, N-(4-ethoxyphenyl)-; p-Acetophenetidide; p-Ethoxyacetanilide; Acetophenetidin; Acetophenetidine; Acetophenetin; Fenidina; Fenina; Kalmin; N-Acetyl-p-phenetidine; Pertonal; Phenacetine; Phenazetin; Phenedina; Phenidin; Phenin; 4-Ethoxyacetanilide; 4'-Ethoxyacetanilide; Phenacitin; p-Acetophenetide; p-Acetophenetidine; p-Acetphenetidin; p-Phenetidine, N-acetyl-; Acet-p-phenalide; Acet-p-phenetidin; Acetanilide, 4'-ethoxy-; Aceto-4-phenetidine; N-(4-Ethoxyphenyl)acetamide; Phenacet; Pyraphen; 1-Acetamido-4-ethoxybenzene; Aceto-para-phenalide; Aceto-para-phenetidide; para-Acetophenetidide; Acetphenetidin; Acetylphenetidin; Achrocidin; Anapac; APC; ASA COMPOUND; Bromo seltzer; Buff-A-comp; Citra-fort; Clistanol; Codempiral; Commotional; Contradol; Contradouleur; Coricidin; Coriforte; Coryban-D; Daprisal; Darvon compound; Dasikon; Dasin; Dasin CH; Dolostop; Dolviran; Edrisal; Empiral; Empirin compound; Emprazil; Emprazil-C; Epragen; p-Ethoxyanilid kyseliny octove; N-para-Ethoxyphenylacetamide; Fenacetin; Fenacetina; Fenia; Fiorinal; Fortacyl; Gelonida; Gewodin; Helvagit; Hjorton'S powder; Hocophen; KAFA; Malex; Melabon; Melaforte; Norgesic; Pamprin; Paracetophenetidin; Paramette; Paratodol; para-Phenacetin; Phenacetinum; Phenacon; Phenaphen; Phenaphen plus; Phenazetina; Phenodyne; Pyrroxate; Quadronal; RCRA Waste number U187; Robaxisal-PH; Salgydal; Sanalgine; Saridon; Seranex; Sinedal; Sinubid; Sinutab; Stellacyl; Super anahist; Synalgos-DC; Synalogos; Tacol; Terracydin; Tetracydin; Thephorin A-C; Treupel; Veganine; Viden; Wigraine; Xaril; Zactirin compound; p-Acetophenetitide; Para-acetphenetidin; Acetanilide, p-ethoxy-; 4-Ethoxy-acetanilid; 4-(Acetylamino)phenetole; N-Acetyl-4-ethoxyaniline; N-Acetyl-p-ethoxyaniline; P-A-C Compound (Salt/Mix); Phensal (Salt/Mix); Butigetic (Salt/Mix)

Condensed phase thermochemistry data

Data compiled by: Hussein Y. Afeefy, Joel F. Liebman, and Stephen E. Stein
Quantity | Value | Units | Method | Reference | Comment |
---|---|---|---|---|---|
ΔfH°solid | -81.6 | kcal/mol | Ccb | Lemoult, 1906 | Author value for hf298-condensed=-88.5 kcal/mol |
Quantity | Value | Units | Method | Reference | Comment |
ΔcH°solid | -1303. | kcal/mol | Ccb | Lemoult, 1906 | Author value for hf298-condensed=-88.5 kcal/mol |

Phase change data

Data compiled as indicated in comments:
TRC - Thermodynamics Research Center, NIST Boulder Laboratories, Chris Muzny director
AC - William E. Acree, Jr., James S. Chickos
ALS - Hussein Y. Afeefy, Joel F. Liebman, and Stephen E. Stein
Quantity | Value | Units | Method | Reference | Comment |
---|---|---|---|---|---|
Tfus | 407.2 | K | N/A | Manzo and Ahumanda, 1990 | Uncertainty assigned by TRC = 0.5 K; TRC |
Tfus | 410.0 | K | N/A | Khattab, 1983 | Uncertainty assigned by TRC = 0.6 K; TRC |
Tfus | 410. | K | N/A | Grady, Hays, et al., 1973 | Uncertainty assigned by TRC = 1. K; TRC |
Quantity | Value | Units | Method | Reference | Comment |
ΔsubH° | 28.7 ± 0.7 | kcal/mol | Vap+Fus | Vecchio and Tomassetti, 2009 | AC |
ΔsubH° | 27.6 | kcal/mol | V | Wiedemann, 1972 | ALS |
Enthalpy of vaporization
ΔvapH (kcal/mol) | Temperature (K) | Method | Reference | Comment |
---|---|---|---|---|
19. ± 0.2 | 459. | TGA | Vecchio and Tomassetti, 2009 | AC |
20. ± 0.2 | 476. | TGA | Vecchio and Tomassetti, 2009 | AC |
19.7 | 478. | A | Stephenson and Malanowski, 1987 | Based on data from 463. to 533. K.; AC |
Enthalpy of sublimation
ΔsubH (kcal/mol) | Temperature (K) | Method | Reference | Comment |
---|---|---|---|---|
27.61 ± 0.57 | 312. to 387. | C,ME | Wiedemann, 1972 | See also Stephenson and Malanowski, 1987.; AC |
Enthalpy of fusion
ΔfusH (kcal/mol) | Temperature (K) | Method | Reference | Comment |
---|---|---|---|---|
6.871 | 408.3 | DSC | Peña, Escalera, et al., 2009 | AC |
7.2 | 409.6 | DSC | Vecchio and Tomassetti, 2009 | AC |
8.15 | 407.4 | DSC | Wassvik, Holmén, et al., 2006 | See also Wassvik, Holmén, et al., 2008.; AC |
5.11 | 410.2 | DSC | Vecchio, Catalani, et al., 2004 | AC |
7.469 | 407.2 | N/A | Manzo and Ahumada, 1990 | AC |

Kovats' RI, non-polar column, isothermal

View large format table.

Column type Active phase Temperature (C) I Reference Comment
CapillaryBP-1200.1660.Japp, Gill, et al., 198725. m/0.22 mm/0.25 μm, N2
CapillaryBP-1200.1666.Japp, Gill, et al., 198725. m/0.53 mm/1. μm, N2
PackedSE-30180.1695.Musumarra, Scarlata, et al., 1987N2, 1% se-30 on Anachrom ABS(80-100mesh); Column length: 2. m
CapillarySPB-1250.1699.Lora-Tamayo, Rams, et al., 1986He; Column length: 25. m; Column diameter: 0.20 mm
PackedOV-1200.1680.Berninger and Möller, 1977
PackedOV-101200.1670.Möller, 1976N2, Chromosorb G AW DMCS (80-100 mesh); Column length: 2. m
PackedOV-101200.1681.Möller, 1976N2, Chromosorb G AW DMCS (80-100 mesh); Column length: 2. m
PackedOV-101200.1685.Möller, 1976N2, Chromosorb G AW DMCS (80-100 mesh); Column length: 2. m
PackedOV-101200.1690.Möller, 1976N2, Chromosorb G AW DMCS (80-100 mesh); Column length: 2. m
PackedOV-101150.1666.Möller, 1976N2, Chromosorb W; Column length: 2. m
PackedOV-101190.1681.Möller, 1976N2, Chromosorb W; Column length: 2. m
PackedOV-101230.1720.Möller, 1976N2, Chromosorb W; Column length: 2. m

Kovats' RI, non-polar column, custom temperature program

View large format table.

Column type Active phase I Reference Comment
PackedOV-1011700.McLinden and Stenhouse, 1979N2, Chromosorb W; Column length: 2. m; Program: not specified
PackedOV-11675.Berninger, Grunnagel, et al., 1975N2, Chromosorb G, AW-DMCS; Column length: 2. m; Program: not specified
PackedOV-11685.Berninger, Grunnagel, et al., 1975N2, Chromosorb G, AW-DMCS; Column length: 2. m; Program: not specified
PackedSE-301660.Moffat, Stead, et al., 1974Column length: 2. m; Program: not specified

Van Den Dool and Kratz RI, non-polar column, temperature ramp

View large format table.

Column type Active phase I Reference Comment
CapillarySPB-11685.Christ, Noomano, et al., 198830. m/0.75 mm/1.0 μm, He, 10. K/min, 280. C @ 12. min; Tstart: 160. C
PackedSE-301660.Perrigo and Peel, 1981N2, Chromosorb W, 130. C @ 2. min, 8. K/min, 290. C @ 8. min; Column length: 1.8 m

Van Den Dool and Kratz RI, non-polar column, custom temperature program

View large format table.

Column type Active phase I Reference Comment
CapillaryBP-11651.Stowell and Wilson, 198712. m/0.22 mm/0.25 μm, He; Program: 120C => 8C/min => 270C => 25C/min => 300C

Normal alkane RI, non-polar column, isothermal

View large format table.

Column type Active phase Temperature (C) I Reference Comment
PackedOV-101180.1662.Dubsky, Hána, et al., 1978Nitrogen, Chromosorb G (100-120 mesh); Column length: 2. m
PackedOV-101200.1681.Dubsky, Hána, et al., 1978Nitrogen, Chromosorb G (100-120 mesh); Column length: 2. m
PackedOV-101200.1660.Möller, 1976N2, Chromosorb G AW DMCS (80-100 mesh); Column length: 2. m

Normal alkane RI, non-polar column, temperature ramp

View large format table.

Column type Active phase I Reference Comment
PackedSE-301705.Marozzi, Gambaro, et al., 1982Gas Chrom P, 2.5 K/min; Column length: 2. m; Tstart: 120. C; Tend: 200. C

Normal alkane RI, non-polar column, custom temperature program

View large format table.

Column type Active phase I Reference Comment
CapillaryBP-11651.Stowell and Wilson, 198512. m/0.22 mm/0.25 μm, He; Program: 120 0X 8 0C/min -> 270 0C 25 0C/min -> 300 0C (5 min)
CapillaryBP-11660.Stowell and Wilson, 198512. m/0.22 mm/0.25 μm, He; Program: not specified
CapillaryOV-1, SE-30, Methyl silicone, SP-2100, OV-101, DB-1, etc.1699.Waggott and Davies, 1984Hydrogen; Column length: 50. m; Column diameter: 0.32 mm; Program: not specified
OtherMethyl Silicone1675.Ardrey and Moffat, 1981Program: not specified
PackedOV-1011668.Dubsky, Hána, et al., 1978Nitrogen, Chromosorb G (100-120 mesh); Column length: 2. m; Program: not specified
PackedOV-1011660.Dubsky, Hána, et al., 1978Nitrogen, Chromosorb G (100-120 mesh); Column length: 2. m; Program: not specified

Lee's RI, non-polar column, temperature ramp

View large format table.

Column type Active phase I Reference Comment
CapillaryDB-5MS285.77Chen, Keeran, et al., 200230. m/0.25 mm/0.5 μm, 40. C @ 1. min, 10. K/min; Tend: 310. C
CapillaryDB-5MS288.72Chen, Keeran, et al., 200230. m/0.25 mm/0.5 μm, 40. C @ 1. min, 4. K/min; Tend: 310. C

References

Lemoult, 1906
Lemoult, M.P.,
Thermochimie. - Chaleur de combustion et de formation de quelques composes cycliques azotes,
Compt. Rend., 1906, 143, 772-775. [all data]
Manzo and Ahumanda, 1990
Manzo, R.H.; Ahumanda, A.A.,
Effects of solvent medium on solubility. V: Enthalpic and entropic contributions to the free energy changes of Di-substituted benzene derivatives in ethanol: Water and ethanol: Cyclohexane mixtures,
J. Pharm. Sci., 1990, 79, 12, 1109, https://doi.org/10.1002/jps.2600791214
. [all data]
Khattab, 1983
Khattab, F.I.,
Thermochim. Acta, 1983, 61, 253-268. [all data]
Grady, Hays, et al., 1973
Grady, L.T.; Hays, S.E.; King, R.H.; Klein, H.R.; Mader, W.J.; Wyatt, D.K.; Zimmere, R.O.,
Drug purity profiles,
J. Pharm. Sci., 1973, 62, 459. [all data]
Vecchio and Tomassetti, 2009
Vecchio, Stefano; Tomassetti, Mauro,
Vapor pressures and standard molar enthalpies, entropies and Gibbs energies of sublimation of three 4-substituted acetanilide derivatives,
Fluid Phase Equilibria, 2009, 279, 1, 64-72, https://doi.org/10.1016/j.fluid.2009.02.001
. [all data]
Wiedemann, 1972
Wiedemann, H.G.,
Applications of thermogravimetry for vapor pressure determination,
Thermochim. Acta, 1972, 355-366. [all data]
Stephenson and Malanowski, 1987
Stephenson, Richard M.; Malanowski, Stanislaw,
Handbook of the Thermodynamics of Organic Compounds, 1987, https://doi.org/10.1007/978-94-009-3173-2
. [all data]
Peña, Escalera, et al., 2009
Peña, M.A.; Escalera, B.; Reíllo, A.; Sánchez, A.B.; Bustamante, P.,
Thermodynamics of cosolvent action: Phenacetin, salicylic acid and probenecid,
J. Pharm. Sci., 2009, 98, 3, 1129-1135, https://doi.org/10.1002/jps.21497
. [all data]
Wassvik, Holmén, et al., 2006
Wassvik, Carola M.; Holmén, Anders G.; Bergström, Christel A.S.; Zamora, Ismael; Artursson, Per,
Contribution of solid-state properties to the aqueous solubility of drugs,
European Journal of Pharmaceutical Sciences, 2006, 29, 3-4, 294-305, https://doi.org/10.1016/j.ejps.2006.05.013
. [all data]
Wassvik, Holmén, et al., 2008
Wassvik, Carola M.; Holmén, Anders G.; Draheim, Rieke; Artursson, Per; Bergström, Christel A.S.,
Molecular Characteristics for Solid-State Limited Solubility,
J. Med. Chem., 2008, 51, 10, 3035-3039, https://doi.org/10.1021/jm701587d
. [all data]
Vecchio, Catalani, et al., 2004
Vecchio, Stefano; Catalani, Alessia; Rossi, Vanessa; Tomassetti, Mauro,
Thermal analysis study on vaporization of some analgesics. Acetanilide and derivatives,
Thermochimica Acta, 2004, 420, 1-2, 99-104, https://doi.org/10.1016/j.tca.2003.09.039
. [all data]
Manzo and Ahumada, 1990
Manzo, Ruben H.; Ahumada, Amelia A.,
Effects of solvent medium on solubility. V: Enthalpic and entropic contributions to the free energy changes of Di-substituted benzene derivatives in ethanol: Water and ethanol: Cyclohexane mixtures,
J. Pharm. Sci., 1990, 79, 12, 1109-1115, https://doi.org/10.1002/jps.2600791214
. [all data]