(.+-.)-4-methyl-1-cyclohexanol
- Formula: C7H14O
- Molecular weight: 114.1855
- IUPAC Standard InChIKey: MQWCXKGKQLNYQG-UHFFFAOYSA-N
- CAS Registry Number: 624-32-8
- Chemical structure:
View 3d structure (requires JavaScript / HTML 5) - Species with the same structure:
- Stereoisomers:

Phase change data

Data compiled by: Thermodynamics Research Center, NIST Boulder Laboratories, Chris Muzny director
Quantity | Value | Units | Method | Reference | Comment |
---|---|---|---|---|---|
Tboil | 375. | K | N/A | Stork and White, 1956 | Uncertainty assigned by TRC = 3. K |

References

Stork and White, 1956
Stork, G.; White, W.N.,
The Stereochemistry of the SN2' Reaction II.,
J. Am. Chem. Soc., 1956, 78, 4609. [all data]