Hexane, 1,2-dibromo-
- Formula: C6H12Br2
- Molecular weight: 243.967
- IUPAC Standard InChIKey: NUUUANNAZVEWHM-UHFFFAOYSA-N
- CAS Registry Number: 624-20-4
- Chemical structure:

Phase change data

Data compiled as indicated in comments:
TRC - Thermodynamics Research Center, NIST Boulder Laboratories, Chris Muzny director
AC - William E. Acree, Jr., James S. Chickos
Quantity | Value | Units | Method | Reference | Comment |
---|---|---|---|---|---|
Tboil | 360.15 | K | N/A | Timmermans, 1927 | Uncertainty assigned by TRC = 0.5 K; source of data not clear; TRC |
Quantity | Value | Units | Method | Reference | Comment |
ΔvapH° | 13.5 ± 0.48 | kcal/mol | N/A | Varushchenko, Puchkova, et al., 1993 | Based on data from 363. to 450. K.; AC |

References

Timmermans, 1927
Timmermans, J.,
The Melting Point of Organic Substances,
Bull. Soc. Chim. Belg., 1927, 36, 502. [all data]
Varushchenko, Puchkova, et al., 1993
Varushchenko, R.M.; Puchkova, G.A.; Druzhinina, A.I.,
Saturated vapor pressures and heats of evaporation of 1,2-dibromo-n-alkanes C2-C8,
Zh. Fiz. Khim., 1993, 67, 5, 897. [all data]