2,6-Octadien-1-ol, 3,7-dimethyl-
- Formula: C10H18O
- Molecular weight: 154.2493
- IUPAC Standard InChIKey: GLZPCOQZEFWAFX-UHFFFAOYSA-N
- CAS Registry Number: 624-15-7
- Chemical structure:
View 3d structure (requires JavaScript / HTML 5) - Stereoisomers:
- Other names: 3,7-Dimethyl-2,6-octadien-1-ol

Condensed phase thermochemistry data

Data compiled by: Hussein Y. Afeefy, Joel F. Liebman, and Stephen E. Stein
Quantity | Value | Units | Method | Reference | Comment |
---|---|---|---|---|---|
ΔcH°solid | -6160.9 | kJ/mol | Ccb | Yamada, 1941 | Corresponding ΔfHºsolid = -346. kJ/mol (simple calculation by NIST; no Washburn corrections) |

Normal alkane RI, non-polar column, temperature ramp

Column type | Active phase | I | Reference | Comment |
---|---|---|---|---|
Capillary | DB-5 | 1260. | Cao, Li, et al., 2011 | 30. m/0.25 mm/0.25 μm, Helium, 40. C @ 5. min, 3. K/min, 250. C @ 20. min |

References

Yamada, 1941
Yamada, S.,
Researches on camphor, borneol and their allied substances,
Bull. Chem. Soc. Jpn., 1941, 16, 187-196. [all data]