1-Dimethyl(pentafluorophenyl)silyloxybutane
- Formula: C12H15F5OSi
- Molecular weight: 298.3244
- IUPAC Standard InChIKey: LNSUTIGYNISUEC-UHFFFAOYSA-N
- CAS Registry Number: 62394-61-0
- Chemical structure:
View 3d structure (requires JavaScript / HTML 5) - Other names: Benzene, 1-(butoxydimethylsilyl)-2,3,4,5,6-pentafluoro-; 1-Butanol, FP; 1-Butanol DMPFPS

Kovats' RI, non-polar column, custom temperature program

Column type | Active phase | I | Reference | Comment |
---|---|---|---|---|
Packed | SE-30 | 1230. | Francis, Morgan, et al., 1978 | N2, Chromosorb P AW DMCS; Column length: 2. m; Program: not specified |

References

Francis, Morgan, et al., 1978
Francis, A.J.; Morgan, E.D.; Poole, C.F.,
Flophemesyl Derivatives of Alcohols, Phenols, Amines and Carboxylic Acids and Their Use in Gas Chromatography with Electron-Capture Detection,
J. Chromatogr., 1978, 161, 111-117, https://doi.org/10.1016/S0021-9673(01)85218-3
. [all data]