5-Nonanol
- Formula: C9H20O
- Molecular weight: 144.2545
- IUPAC Standard InChIKey: FCBBRODPXVPZAH-UHFFFAOYSA-N
- CAS Registry Number: 623-93-8
- Chemical structure:
View 3d structure (requires JavaScript / HTML 5) - Other names: Dibutylcarbinol; Nonanol-(5); nonan-5-ol

Phase change data

Data compiled as indicated in comments:
TRC - Thermodynamics Research Center, NIST Boulder Laboratories, Chris Muzny director
BS - Robert L. Brown and Stephen E. Stein
AC - William E. Acree, Jr., James S. Chickos
Quantity | Value | Units | Method | Reference | Comment |
---|---|---|---|---|---|
Tboil | 468.24 | K | N/A | Mears, Fookson, et al., 1950 | Uncertainty assigned by TRC = 0.2 K; TRC |
Tboil | 469. | K | N/A | Mulliken, Wakeman, et al., 1935 | Uncertainty assigned by TRC = 4. K; ~; TRC |
Tboil | 467.15 | K | N/A | Vavon and Ivanoff, 1923 | Uncertainty assigned by TRC = 3. K; TRC |
Tboil | 466.15 | K | N/A | Henry, 1906 | Uncertainty assigned by TRC = 3. K; TRC |
Quantity | Value | Units | Method | Reference | Comment |
Tfus | 278.75 | K | N/A | Mears, Fookson, et al., 1950 | Uncertainty assigned by TRC = 0.3 K; TRC |
Quantity | Value | Units | Method | Reference | Comment |
ΔvapH° | 71.4 ± 0.4 | kJ/mol | GS | Verevkin and Schick, 2007 | Based on data from 289. to 334. K.; AC |
Reduced pressure boiling point
Tboil (K) | Pressure (bar) | Reference | Comment |
---|---|---|---|
370.2 | 0.027 | Weast and Grasselli, 1989 | BS |

References

Mears, Fookson, et al., 1950
Mears, T.W.; Fookson, A.; Pomerantz, P.; Rich, E.H.; Dussinger, C.S.; Howard, F.L.,
Syntheses and Properties of Two Olefins, Six Paraffins, and Their Intermediates,
J. Res. Natl. Bur. Stand. (U. S.), 1950, 44, 299. [all data]
Mulliken, Wakeman, et al., 1935
Mulliken, S.P.; Wakeman, R.L.; Gerry, H.T.,
The preparation of certain alkenes, alkadienes and alkynes,
J. Am. Chem. Soc., 1935, 57, 1605-7. [all data]
Vavon and Ivanoff, 1923
Vavon, G.; Ivanoff, D.,
C. R. Hebd. Seances Acad. Sci., 1923, 177, 453. [all data]
Henry, 1906
Henry, L.,
C. R. Hebd. Seances Acad. Sci., 1906, 143, 102. [all data]
Verevkin and Schick, 2007
Verevkin, Sergey P.; Schick, Christoph,
Vapour pressures and heat capacity measurements on the C7--C9 secondary aliphatic alcohols,
The Journal of Chemical Thermodynamics, 2007, 39, 5, 758-766, https://doi.org/10.1016/j.jct.2006.10.007
. [all data]
Weast and Grasselli, 1989
CRC Handbook of Data on Organic Compounds, 2nd Editon, Weast,R.C and Grasselli, J.G., ed(s)., CRC Press, Inc., Boca Raton, FL, 1989, 1. [all data]