Ethyl bis(siopropyl)cyanoacetate
- Formula: C11H19NO2
- Molecular weight: 197.2741
- CAS Registry Number: 62391-95-1

Gas phase thermochemistry data

Data compiled by: Hussein Y. Afeefy, Joel F. Liebman, and Stephen E. Stein
Quantity | Value | Units | Method | Reference | Comment |
---|---|---|---|---|---|
ΔfH°gas | -422.7 ± 1.8 | kJ/mol | Ccb | Verevkin, Beckhaus, et al., 1995 |

Condensed phase thermochemistry data

Data compiled by: Hussein Y. Afeefy, Joel F. Liebman, and Stephen E. Stein
Quantity | Value | Units | Method | Reference | Comment |
---|---|---|---|---|---|
ΔfH°liquid | -507.7 ± 1.5 | kJ/mol | Ccb | Verevkin, Beckhaus, et al., 1995 | |
Quantity | Value | Units | Method | Reference | Comment |
ΔcH°liquid | -6536.3 ± 1.1 | kJ/mol | Ccb | Verevkin, Beckhaus, et al., 1995 |

Phase change data

Data compiled as indicated in comments:
ALS - Hussein Y. Afeefy, Joel F. Liebman, and Stephen E. Stein
AC - William E. Acree, Jr., James S. Chickos
Quantity | Value | Units | Method | Reference | Comment |
---|---|---|---|---|---|
ΔvapH° | 65.02 ± 0.88 | kJ/mol | V | Verevkin, Beckhaus, et al., 1995 | ALS |
ΔvapH° | 65.0 ± 0.9 | kJ/mol | GS | Verevkin, Beckhaus, et al., 1995 | Based on data from 284. to 319. K.; AC |

References

Verevkin, Beckhaus, et al., 1995
Verevkin, S.P.; Beckhaus, H.-D.; Ruchardt, C.,
Geminale substituenteneffekte. Teil 6. Standardbildungsenthalpien von alkylsubstituierten-alkoxynitrilen und α-cyano-carbonsaureestern,
Thermochim. Acta, 1995, 249, 1-11. [all data]