Carbamic acid, ethyl-, ethyl ester
- Formula: C5H11NO2
- Molecular weight: 117.1463
- IUPAC Standard InChIKey: GZXSDYYWLZERLF-UHFFFAOYSA-N
- CAS Registry Number: 623-78-9
- Chemical structure:
View 3d structure (requires JavaScript / HTML 5) - Other names: Ethyl ethylcarbamate; N-Ethylurethane; Ethyl N-ethylcarbamate; Ethylcarbamic acid, ethyl ester

Phase change data

Data compiled as indicated in comments:
TRC - Thermodynamics Research Center, NIST Boulder Laboratories, Chris Muzny director
BS - Robert L. Brown and Stephen E. Stein
Quantity | Value | Units | Method | Reference | Comment |
---|---|---|---|---|---|
Tboil | 458.4 | K | N/A | Lecat, 1943 | Uncertainty assigned by TRC = 0.3 K; TRC |
Reduced pressure boiling point
Tboil (K) | Pressure (bar) | Reference | Comment |
---|---|---|---|
358.2 | 0.027 | Weast and Grasselli, 1989 | BS |

References

Lecat, 1943
Lecat, M.,
Azeotropes of Ethyl Urethane and other Azeotropes,
C. R. Hebd. Seances Acad. Sci., 1943, 217, 273. [all data]
Weast and Grasselli, 1989
CRC Handbook of Data on Organic Compounds, 2nd Editon, Weast,R.C and Grasselli, J.G., ed(s)., CRC Press, Inc., Boca Raton, FL, 1989, 1. [all data]