3-Hexanone, 5-methyl-
- Formula: C7H14O
- Molecular weight: 114.1855
- IUPAC Standard InChIKey: DXVYLFHTJZWTRF-UHFFFAOYSA-N
- CAS Registry Number: 623-56-3
- Chemical structure:
View 3d structure (requires JavaScript / HTML 5) - Other names: Ethyl isobutyl ketone; Isobutyl ethyl ketone; 2-Methyl-4-hexanone; 5-Methyl-3-hexanone; 5-methylhexan-3-one

Phase change data

Data compiled as indicated in comments:
TRC - Thermodynamics Research Center, NIST Boulder Laboratories, Chris Muzny director
BS - Robert L. Brown and Stephen E. Stein
Quantity | Value | Units | Method | Reference | Comment |
---|---|---|---|---|---|
Tboil | 410. ± 2. | K | AVG | N/A | Average of 6 values; Individual data points |
Reduced pressure boiling point
Tboil (K) | Pressure (bar) | Reference | Comment |
---|---|---|---|
407.2 | 0.980 | Weast and Grasselli, 1989 | BS |

Kovats' RI, non-polar column, isothermal

View large format table.

Column type Active phase Temperature (C) I Reference Comment
CapillaryOV-1333.816.7Hu, Lu, et al., 2006

Kovats' RI, polar column, isothermal

View large format table.

Column type Active phase Temperature (C) I Reference Comment
CapillaryPEG-20M97.1005.Watabe, Hobo, et al., 1981N2; Column length: 15. m; Column diameter: 0.35 mm

Van Den Dool and Kratz RI, non-polar column, temperature ramp

View large format table.

Column type Active phase I Reference Comment
CapillaryDB-5865.Guichard and Souty, 1988H2, 30. C @ 5. min, 1.5 K/min; Column length: 0.32 m; Column diameter: 1. mm; Tend: 180. C

Normal alkane RI, non-polar column, isothermal

View large format table.

Column type Active phase Temperature (C) I Reference Comment
CapillaryOV-160.816.Amboni, Junkes, et al., 2002

Normal alkane RI, non-polar column, custom temperature program

View large format table.

Column type Active phase I Reference Comment
CapillaryMethyl Silicone817.Feng and Mu, 2007Program: not specified
CapillaryPolydimethyl siloxane816.Junkes, Castanho, et al., 2003Program: not specified
CapillaryMethyl Silicone817.Estrada and Gutierrez, 1999Program: not specified

References

Weast and Grasselli, 1989
CRC Handbook of Data on Organic Compounds, 2nd Editon, Weast,R.C and Grasselli, J.G., ed(s)., CRC Press, Inc., Boca Raton, FL, 1989, 1. [all data]