Carbonic acid, ethyl-, methyl ester
- Formula: C4H8O3
- Molecular weight: 104.1045
- IUPAC Standard InChIKey: JBTWLSYIZRCDFO-UHFFFAOYSA-N
- CAS Registry Number: 623-53-0
- Chemical structure:
- Other names: Ethoxyacetic acid, methyl ester; C2H5OCOOCH3; ethyl methyl carbonate

Phase change data

Data compiled by: William E. Acree, Jr., James S. Chickos
Enthalpy of fusion
ΔfusH (kJ/mol) | Temperature (K) | Method | Reference |
---|---|---|---|
11.24 | 219.4 | DSC | Ding, 2004 |

Gas phase ion energetics data

Data evaluated by: Edward P. Hunter and Sharon G. Lias
Quantity | Value | Units | Method | Reference | Comment |
---|---|---|---|---|---|
Proton affinity (review) | 842.7 | kJ/mol | N/A | Hunter and Lias, 1998 | |
Quantity | Value | Units | Method | Reference | Comment |
Gas basicity | 810.8 | kJ/mol | N/A | Hunter and Lias, 1998 |

References

Ding, 2004
Ding, Michael S.,
Liquid-Solid Phase Equilibria and Thermodynamic Modeling for Binary Organic Carbonates,
J. Chem. Eng. Data, 2004, 49, 2, 276-282, https://doi.org/10.1021/je034134e
. [all data]
Hunter and Lias, 1998
Hunter, E.P.; Lias, S.G.,
Evaluated Gas Phase Basicities and Proton Affinities of Molecules: An Update,
J. Phys. Chem. Ref. Data, 1998, 27, 3, 413-656, https://doi.org/10.1063/1.556018
. [all data]