Ethyl propiolate
- Formula: C5H6O2
- Molecular weight: 98.0999
- IUPAC Standard InChIKey: FMVJYQGSRWVMQV-UHFFFAOYSA-N
- CAS Registry Number: 623-47-2
- Chemical structure:
View 3d structure (requires JavaScript / HTML 5) - Other names: Ethyl acetylenecarboxylate; Propiolic acid ethyl ester; Ethyl propynoate; 2-Propynoic acid, ethyl ester; (Ethoxycarbonyl)acetylene; Ethyl 2-propynoate

Condensed phase thermochemistry data

Data compiled as indicated in comments:
DRB - Donald R. Burgess, Jr.
ALS - Hussein Y. Afeefy, Joel F. Liebman, and Stephen E. Stein
Quantity | Value | Units | Method | Reference | Comment |
---|---|---|---|---|---|
ΔfH°liquid | -166.0 ± 3.0 | kJ/mol | Ccb | N/A | recalculated with modern CO2,H2O thermo; estimated uncertainty (NOTE all values in source also have wrong sign); DRB |
ΔfH°liquid | 187. | kJ/mol | Ccb | Moureu and Andre, 1914 | ALS |
Quantity | Value | Units | Method | Reference | Comment |
ΔcH°liquid | -2659. | kJ/mol | Ccb | Moureu and Andre, 1914 | Corresponding ΔfHºliquid = -167. kJ/mol (simple calculation by NIST; no Washburn corrections); ALS |

Phase change data

Data compiled as indicated in comments:
BS - Robert L. Brown and Stephen E. Stein
TRC - Thermodynamics Research Center, NIST Boulder Laboratories, Chris Muzny director
Quantity | Value | Units | Method | Reference | Comment |
---|---|---|---|---|---|
Tboil | 393.2 | K | N/A | Aldrich Chemical Company Inc., 1990 | BS |
Tboil | 393. | K | N/A | Farchan Laboratories, 1990 | BS |
Tboil | 392.65 | K | N/A | Moureu and Andre, 1914, 2 | Uncertainty assigned by TRC = 2. K; TRC |

References

Moureu and Andre, 1914
Moureu, C.; Andre, E.,
Thermochimie des composes acetyleniques,
Ann. Chim. Phys., 1914, 1, 113-145. [all data]
Aldrich Chemical Company Inc., 1990
Aldrich Chemical Company Inc.,
Catalog Handbook of Fine Chemicals, Aldrich Chemical Company, Inc., Milwaukee WI, 1990, 1. [all data]
Farchan Laboratories, 1990
Farchan Laboratories,
Research Chemicals Catalog, Farchan Laboratories, Gainesville, FL, 1990, 91. [all data]
Moureu and Andre, 1914, 2
Moureu, C.; Andre, E.,
Thermochemistry of Acetylenic Compounds,
Ann. Chim. (Paris), 1914, 1, 113. [all data]