2-Propenal, 3-(2-furanyl)-
- Formula: C7H6O2
- Molecular weight: 122.1213
- IUPAC Standard InChIKey: VZIRCHXYMBFNFD-HNQUOIGGSA-N
- CAS Registry Number: 623-30-3
- Chemical structure:
View 3d structure (requires JavaScript / HTML 5) - Species with the same structure:
- Other names: 2-Furanacrolein; 3-(α-Furyl)propenal; 3-(2-Furyl)acrolein; 3-(2-Furyl)-2-propenal; β-(2-Furyl)acrolein; 3-(2-Furanyl)-2-propenal; NSC 2061; NSC 26338; 1-(2-furanyl)-1-propen-3-al; 3-(2-furyl)acrylaldehyde

Gas phase thermochemistry data

Data compiled by: Hussein Y. Afeefy, Joel F. Liebman, and Stephen E. Stein
Quantity | Value | Units | Method | Reference | Comment |
---|---|---|---|---|---|
ΔfH°gas | -106. ± 3. | kJ/mol | Ccb | Balepin, Lebedev, et al., 1980 | see Balepin, Lebedev, et al., 1978 |

Condensed phase thermochemistry data

Data compiled by: Hussein Y. Afeefy, Joel F. Liebman, and Stephen E. Stein
Quantity | Value | Units | Method | Reference | Comment |
---|---|---|---|---|---|
ΔfH°solid | -182. ± 0.8 | kJ/mol | Ccb | Balepin, Lebedev, et al., 1980 | see Balepin, Lebedev, et al., 1978 |
Quantity | Value | Units | Method | Reference | Comment |
ΔcH°solid | -3430. ± 0.8 | kJ/mol | Ccb | Balepin, Lebedev, et al., 1980 | see Balepin, Lebedev, et al., 1978; Corresponding ΔfHºsolid = -182. kJ/mol (simple calculation by NIST; no Washburn corrections) |

Phase change data

Data compiled as indicated in comments:
DRB - Donald R. Burgess, Jr.
ALS - Hussein Y. Afeefy, Joel F. Liebman, and Stephen E. Stein
Quantity | Value | Units | Method | Reference | Comment |
---|---|---|---|---|---|
ΔsubH° | 76.0 | kJ/mol | N/A | Balepin, Lebedev, et al., 1980 | DRB |
Enthalpy of sublimation
ΔsubH (kJ/mol) | Temperature (K) | Method | Reference | Comment |
---|---|---|---|---|
76. ± 2. | 289. | V | Balepin, Lebedev, et al., 1980 | see Balepin, Lebedev, et al., 1978; ALS |

Van Den Dool and Kratz RI, polar column, temperature ramp

Column type | Active phase | I | Reference | Comment |
---|---|---|---|---|
Capillary | CP-WAX 57CB | 1831. | Baltes and Mevissen, 1988 | He, 50. C @ 5. min, 2. K/min; Column length: 50. m; Column diameter: 0.24 mm; Tend: 210. C |

Van Den Dool and Kratz RI, polar column, custom temperature program

Column type | Active phase | I | Reference | Comment |
---|---|---|---|---|
Capillary | Carbowax | 1839. | Baltes w. and Bochmann G., 1987 | Column diameter: 0.3 mm; Program: not specified |
Capillary | Carbowax | 1839. | Baltes w. and Bochmann G., 1987 | Column diameter: 0.3 mm; Program: not specified |

Normal alkane RI, non-polar column, custom temperature program

Column type | Active phase | I | Reference | Comment |
---|---|---|---|---|
Capillary | HP-5 | 1111. | Zhao, Li, et al., 2008 | 30. m/0.25 mm/0.25 μm; Program: 40 0C (2 min) 5 0C/min -> 80 0C 7 oC/min -> 160 0C 9 0C/min -> 200 0C 20 0C/min -> 280 0C (10 min) |

Normal alkane RI, polar column, temperature ramp

Column type | Active phase | I | Reference | Comment |
---|---|---|---|---|
Capillary | DB-Wax | 1851. | Umano, Hagi, et al., 1995 | He, 40. C @ 2. min, 2. K/min; Column length: 60. m; Column diameter: 0.25 mm; Tend: 200. C |

References

Balepin, Lebedev, et al., 1980
Balepin, A.A.; Lebedev, V.P.; Kuznetsova, A.A.; Venter, K.K.; Trushule, M.A.; Lolya, D.O.; Lebedev, Yu.A.,
Thermochemical properties of α-nitro derivatives of furan,
Bull. Acad. Sci. USSR, Div. Chem. Sci., 1980, 601-604. [all data]
Balepin, Lebedev, et al., 1978
Balepin, A.A.; Lebedev, V.P.; Kuznetsova, A.A.; Venters, K.; Trusule, M.; Ignatovich, L.M.; Lebedev, Yu.A.,
Aromatic stabilizatio of furan derivatives,
Vses. Nauchn. Konf. Khim. Tekhnol. Furanovykh Soedin., [Tezisy Dokl.], 1978, 3, 57-58. [all data]
Baltes and Mevissen, 1988
Baltes, W.; Mevissen, L.,
Model reactions on roast aroma formation. VI. Volatile reaction products from the reaction of phenylalanine with glucose during cooking and roasting,
Z. Lebensm. Unters. Forsch., 1988, 187, 3, 209-214, https://doi.org/10.1007/BF01043341
. [all data]
Baltes w. and Bochmann G., 1987
Baltes w.; Bochmann G.,
Model reactions on roast aroma formation. II. Mass spectrometric identification of furans and furanones from the reaction of serine and threonine with sucrose under the conditions of coffee roasting,
Z. Lebensm. Unters. Forsch., 1987, 184, 179-186. [all data]
Zhao, Li, et al., 2008
Zhao, Y.; Li, J.; Xu, Y.; Duan, H.; Fan, W.; Zhao, G.,
EXtraction, preparation and identification of volatile compounds in Changyu XO brandy,
Chinese J. Chromatogr., 2008, 26, 2, 212-222, https://doi.org/10.1016/S1872-2059(08)60014-0
. [all data]
Umano, Hagi, et al., 1995
Umano, K.; Hagi, Y.; Nakahara, K.; Shyoji, A.; Shibamoto, T.,
Volatile chemicals formed in the headspace of a heated D-glucose/L-cysteine Maillard model system,
J. Agric. Food Chem., 1995, 43, 8, 2212-2218, https://doi.org/10.1021/jf00056a046
. [all data]