Benzene, 1,4-bis(chloromethyl)-
- Formula: C8H8Cl2
- Molecular weight: 175.055
- IUPAC Standard InChIKey: ZZHIDJWUJRKHGX-UHFFFAOYSA-N
- CAS Registry Number: 623-25-6
- Chemical structure:
View 3d structure (requires JavaScript / HTML 5) - Isotopologues:
- Other names: p-Xylene, α,α'-dichloro-; α,α'-Dichloro-p-xylene; p-Bis(chloromethyl)benzene; p-Xylene-α,α'-dichloride; p-Xylylene chloride; p-Xylylene dichloride; Benzene, p-bis(chloromethyl)-; Dichlorodi-p-xylylene; 1,4-Bis(chloromethyl)benzene; p-Dichloroxylylene; alpha,alpha'-Dichloro-p-xylene; NSC 36976

Phase change data

Data compiled as indicated in comments:
BS - Robert L. Brown and Stephen E. Stein
TRC - Thermodynamics Research Center, NIST Boulder Laboratories, Chris Muzny director
AC - William E. Acree, Jr., James S. Chickos
Quantity | Value | Units | Method | Reference | Comment |
---|---|---|---|---|---|
Tboil | 527.2 | K | N/A | Aldrich Chemical Company Inc., 1990 | BS |
Tboil | 513. to 518. | K | N/A | Buckingham and Donaghy, 1982 | BS |
Quantity | Value | Units | Method | Reference | Comment |
Tfus | 341.4 | K | N/A | Dreisbach, 1955 | Uncertainty assigned by TRC = 0.02 K; TRC |
Tfus | 373. | K | N/A | Colson, 1887 | Uncertainty assigned by TRC = 1. K; TRC |
Reduced pressure boiling point
Tboil (K) | Pressure (atm) | Reference | Comment |
---|---|---|---|
408. | 0.016 | Buckingham and Donaghy, 1982 | BS |
Enthalpy of fusion
ΔfusH (kcal/mol) | Temperature (K) | Reference | Comment |
---|---|---|---|
5.729 | 373.2 | Acree, 1991 | AC |

References

Aldrich Chemical Company Inc., 1990
Aldrich Chemical Company Inc.,
Catalog Handbook of Fine Chemicals, Aldrich Chemical Company, Inc., Milwaukee WI, 1990, 1. [all data]
Buckingham and Donaghy, 1982
Buckingham, J.; Donaghy, S.M.,
Dictionary of Organic Compounds: Fifth Edition, Chapman and Hall, New York, 1982, 1. [all data]
Dreisbach, 1955
Dreisbach, R.R.,
Physical Properties of Chemical Compounds, Advances in Chemistry Series No. 15, Am. Chem. Soc.: Washington, D. C., 1955. [all data]
Colson, 1887
Colson, XX,
C. R. Hebd. Seances Acad. Sci., 1887, 104, 428. [all data]
Acree, 1991
Acree, William E.,
Thermodynamic properties of organic compounds: enthalpy of fusion and melting point temperature compilation,
Thermochimica Acta, 1991, 189, 1, 37-56, https://doi.org/10.1016/0040-6031(91)87098-H
. [all data]