Acephenanthrylene, 4,5-dihydro-
- Formula: C16H12
- Molecular weight: 204.2665
- IUPAC Standard InChIKey: ZBWXZZIIMVVCNZ-UHFFFAOYSA-N
- CAS Registry Number: 6232-48-0
- Chemical structure:
View 3d structure (requires JavaScript / HTML 5) - Other names: 4,5-Dihydroacephenanthrylene

Gas phase thermochemistry data

Data compiled by: Glushko Thermocenter, Russian Academy of Sciences, Moscow
Constant pressure heat capacity of gas
Cp,gas (J/mol*K) | Temperature (K) | Reference | Comment |
---|---|---|---|
45.24 | 50. | Dorofeeva O.V., 1989 | These statistically calculated values were obtained using force field approximation for polycyclic aromatic hydrocarbons to estimate the needed vibrational frequencies (see also [ Dorofeeva O.V., 1986, Moiseeva N.F., 1990]). These functions are reproduced in the reference book [ Frenkel M., 1994]. |
70.78 | 100. | ||
101.00 | 150. | ||
135.77 | 200. | ||
191.85 | 273.15 | ||
211.4 ± 1.5 | 298.15 | ||
212.86 | 300. | ||
287.09 | 400. | ||
349.75 | 500. | ||
400.18 | 600. | ||
440.66 | 700. | ||
473.54 | 800. | ||
500.61 | 900. | ||
523.16 | 1000. | ||
542.09 | 1100. | ||
558.10 | 1200. | ||
571.73 | 1300. | ||
583.38 | 1400. | ||
593.41 | 1500. |

References

Dorofeeva O.V., 1989
Dorofeeva O.V.,
Thermodynamic Properties of Gaseous Polycyclic Aromatic Hydrocarbons Containing Five-Membered Rings. Institute for High Temperatures, USSR Academy of Sciences, Preprint No.1-263 (in Russian), Moscow, 1989. [all data]
Dorofeeva O.V., 1986
Dorofeeva O.V.,
On calculation of thermodynamic properties of polycyclic aromatic hydrocarbons,
Thermochim. Acta, 1986, 102, 59-66. [all data]
Moiseeva N.F., 1990
Moiseeva N.F.,
Group additivity scheme for calculating the chemical thermodynamic properties of gaseous polycyclic aromatic hydrocarbons containing five-membered rings,
Thermochim. Acta, 1990, 168, 179-186. [all data]
Frenkel M., 1994
Frenkel M.,
Thermodynamics of Organic Compounds in the Gas State, Vol. I, II, Thermodynamics Research Center, College Station, Texas, 1994, 1994. [all data]