Benzene, 1,4-bis(bromomethyl)-
- Formula: C8H8Br2
- Molecular weight: 263.957
- IUPAC Standard InChIKey: RBZMSGOBSOCYHR-UHFFFAOYSA-N
- CAS Registry Number: 623-24-5
- Chemical structure:

Phase change data

Data compiled by: Robert L. Brown and Stephen E. Stein
Quantity | Value | Units | Method | Reference | Comment |
---|---|---|---|---|---|
Tboil | 518.2 | K | N/A | Weast and Grasselli, 1989 | |
Tboil | 518. | K | N/A | Buckingham and Donaghy, 1982 | |
Quantity | Value | Units | Method | Reference | Comment |
Tfus | 418. to 420. | K | N/A | Buckingham and Donaghy, 1982 |
Reduced pressure boiling point
Tboil (K) | Pressure (bar) | Reference |
---|---|---|
428. to 431. | 0.013 to 0.016 | Buckingham and Donaghy, 1982 |

References

Weast and Grasselli, 1989
CRC Handbook of Data on Organic Compounds, 2nd Editon, Weast,R.C and Grasselli, J.G., ed(s)., CRC Press, Inc., Boca Raton, FL, 1989, 1. [all data]
Buckingham and Donaghy, 1982
Buckingham, J.; Donaghy, S.M.,
Dictionary of Organic Compounds: Fifth Edition, Chapman and Hall, New York, 1982, 1. [all data]