1-Methoxy-1-(E)-(1-propenyloxy)ethane
- Formula: C6H12O2
- Molecular weight: 116.1583
- IUPAC Standard InChIKey: UWBQPRFMSUTUBT-SNAWJCMRSA-N
- CAS Registry Number: 62322-64-9
- Chemical structure:
View 3d structure (requires JavaScript / HTML 5) - Stereoisomers:

Reaction thermochemistry data

Data compiled by: Hussein Y. Afeefy, Joel F. Liebman, and Stephen E. Stein
Individual Reactions
By formula: C6H12O2 = C6H12O2
Quantity | Value | Units | Method | Reference | Comment |
---|---|---|---|---|---|
ΔrH° | -0.69 ± 0.05 | kcal/mol | Eqk | Taskinen and Lahteenmaki, 1976 | liquid phase; solvent: Neat liquid |

References

Taskinen and Lahteenmaki, 1976
Taskinen, E.; Lahteenmaki, H.,
Thermodynamics of vinyl ethers-XVIII unsaturated acetals,
Tetrahedron, 1976, 32, 2331-2333. [all data]