Methoxy-(E)-1-propenyloxymethane
- Formula: C5H10O2
- Molecular weight: 102.1317
- IUPAC Standard InChIKey: IMJCADJBSWXYAC-ONEGZZNKSA-N
- CAS Registry Number: 62322-63-8
- Chemical structure:
View 3d structure (requires JavaScript / HTML 5) - Stereoisomers:

Reaction thermochemistry data

Data compiled by: Hussein Y. Afeefy, Joel F. Liebman, and Stephen E. Stein
Individual Reactions
By formula: C5H10O2 = C5H10O2
Quantity | Value | Units | Method | Reference | Comment |
---|---|---|---|---|---|
ΔrH° | -0.55 ± 0.05 | kcal/mol | Eqk | Taskinen and Lahteenmaki, 1976 | liquid phase; solvent: Neat liquid |

References

Taskinen and Lahteenmaki, 1976
Taskinen, E.; Lahteenmaki, H.,
Thermodynamics of vinyl ethers-XVIII unsaturated acetals,
Tetrahedron, 1976, 32, 2331-2333. [all data]