1-Propene, 1-(1-methoxyethoxy)-, (Z)-
- Formula: C6H12O2
- Molecular weight: 116.1583
- IUPAC Standard InChIKey: UWBQPRFMSUTUBT-PLNGDYQASA-N
- CAS Registry Number: 62322-40-1
- Chemical structure:
View 3d structure (requires JavaScript / HTML 5) - Stereoisomers:

Reaction thermochemistry data

Data compiled by: Hussein Y. Afeefy, Joel F. Liebman, and Stephen E. Stein
Individual Reactions
By formula: C7H14O4 = C6H12O2
Quantity | Value | Units | Method | Reference | Comment |
---|---|---|---|---|---|
ΔrH° | -4.8 ± 0.1 | kcal/mol | Eqk | Taskinen, 1993 | liquid phase; solvent: DMSO; Isomerization |
By formula: C6H12O2 = C6H12O2
Quantity | Value | Units | Method | Reference | Comment |
---|---|---|---|---|---|
ΔrH° | -5.11 ± 0.07 | kcal/mol | Eqk | Taskinen, 1993 | liquid phase; solvent: DMSO; Isomerization |
By formula: C6H12O2 = C6H12O2
Quantity | Value | Units | Method | Reference | Comment |
---|---|---|---|---|---|
ΔrH° | -0.69 ± 0.05 | kcal/mol | Eqk | Taskinen and Lahteenmaki, 1976 | liquid phase; solvent: Neat liquid |

References

Taskinen, 1993
Taskinen, E.,
Relative thermodynamic stabilities of isomeric alkyl allyl and alkyl (Z)-propenyl ethers,
Tetrahedron, 1993, 49, 11389-11394. [all data]
Taskinen and Lahteenmaki, 1976
Taskinen, E.; Lahteenmaki, H.,
Thermodynamics of vinyl ethers-XVIII unsaturated acetals,
Tetrahedron, 1976, 32, 2331-2333. [all data]