p-Anisaldehyde phenylhydrazone
- Formula: C14H14N2O
- Molecular weight: 226.2738
- IUPAC Standard InChIKey: IZUQZLGWRCYWCB-UHFFFAOYSA-N
- CAS Registry Number: 622-73-1
- Chemical structure:

Reaction thermochemistry data

Data compiled by: Hussein Y. Afeefy, Joel F. Liebman, and Stephen E. Stein
Individual Reactions
By formula: C14H14N2O + H2O = C6H8N2 + C8H8O2
Quantity | Value | Units | Method | Reference | Comment |
---|---|---|---|---|---|
ΔrH° | -14.8 | kcal/mol | Cm | Landrieu, 1905 | solid phase |

Condensed phase thermochemistry data

Data compiled by: Hussein Y. Afeefy, Joel F. Liebman, and Stephen E. Stein

Quantity Value Units Method Reference Comment
Δfsolid-26.73kcal/molCcbLandrieu, 1905
Δfsolid-38.5kcal/molCmLandrieu, 1905
Quantity Value Units Method Reference Comment
Δcsolid-1768.2kcal/molCcbLandrieu, 1905

References

Landrieu, 1905
Landrieu, M.Ph.,
Thermochimie. - Thermochimie des hydrazones,
Compt. Rend., 1905, 141, 358-361. [all data]