N,N-Dimethylvaleramide
- Formula: C7H15NO
- Molecular weight: 129.2001
- IUPAC Standard InChIKey: BNODIVYXTGTUPS-UHFFFAOYSA-N
- CAS Registry Number: 6225-06-5
- Chemical structure:
View 3d structure (requires JavaScript / HTML 5) - Other names: Pentanamide, N,N-dimethyl-; Valeramide, N,N-dimethyl-; N,N-Dimethylpentanamide; Pentanoic acid, dimethylamide

Phase change data

Data compiled by: Robert L. Brown and Stephen E. Stein
Reduced pressure boiling point
Tboil (K) | Pressure (bar) | Reference |
---|---|---|
378. to 379. | 0.033 | Frinton Laboratories Inc., 1986 |

References

Frinton Laboratories Inc., 1986
Frinton Laboratories Inc.,
Catalog Number 11, Frinton Laboratories Inc., Vineland, NJ, 1986, 99. [all data]