Octopamine, tri-PFP
- Formula: C17H8F15NO5
- Molecular weight: 591.2252
- IUPAC Standard InChIKey: NAEIJMBSQQFJIL-UHFFFAOYSA-N
- CAS Registry Number: 62237-94-9
- Chemical structure:
View 3d structure (requires JavaScript / HTML 5) - Other names: Octopamine, N,O,O-(tris-PFP)-; (.+/-.)-Octopamine, N,O,O'-tris(pentafluoropropionyl)-; 4-(2-[(2,2,3,3,3-Pentafluoropropanoyl)amino]-1-[(2,2,3,3,3-pentafluoropropanoyl)oxy]ethyl)phenyl 2,2,3,3,3-pentafluoropropanoate; Octopamine PFP

Van Den Dool and Kratz RI, non-polar column, custom temperature program

Column type | Active phase | I | Reference | Comment |
---|---|---|---|---|
Capillary | VF-5MS | 1494. | Tretyakov, 2011 | 30. m/0.25 mm/0.25 μm, He; Program: Multi-step temperature program; T(initial)=60C; T(final)=270C |

References

Tretyakov, 2011
Tretyakov, K.V.,
Retention Data. NIST Mass Spectrometry Data Center., NIST Mass Spectrometry Data Center, 2011. [all data]