2-Propanone, methyl-2-propenylhydrazone
- Formula: C7H14N2
- Molecular weight: 126.1995
- IUPAC Standard InChIKey: NLCRTRDPCWXYKO-UHFFFAOYSA-N
- CAS Registry Number: 62237-76-7
- Chemical structure:
View 3d structure (requires JavaScript / HTML 5) - Other names: Acetone methylallylhydrazone; Acetone allyl(methyl)hydrazone

Normal alkane RI, non-polar column, temperature ramp

Column type | Active phase | I | Reference | Comment |
---|---|---|---|---|
Capillary | OV-101 | 839. | Zenkevich, 2005 | 25. m/0.20 mm/0.10 μm, N2/He, 6. K/min; Tstart: 50. C; Tend: 250. C |

References

Zenkevich, 2005
Zenkevich, I.G.,
Experimentally measured retention indices., 2005. [all data]