Benzaldehyde, oxime, (Z)-
- Formula: C7H7NO
- Molecular weight: 121.1366
- IUPAC Standard InChIKey: VTWKXBJHBHYJBI-UHFFFAOYSA-N
- CAS Registry Number: 622-32-2
- Chemical structure:
View 3d structure (requires JavaScript / HTML 5) - Species with the same structure:
- Other names: (Z)-Benzaldoxime; anti-Benzaldoxime; cis-Benzaldoxime; Benzaldehyde oxime, cis

Reaction thermochemistry data

Data compiled by: Hussein Y. Afeefy, Joel F. Liebman, and Stephen E. Stein
Individual Reactions
By formula: C7H7NO = C7H7NO
Quantity | Value | Units | Method | Reference | Comment |
---|---|---|---|---|---|
ΔrH° | -2. ± 0.8 | kJ/mol | Eqk | Sauvaitre, 1972 | liquid phase; solvent: CCl4; IR |
ΔrH° | -2. ± 0.8 | kJ/mol | Eqk | Sauvaitre and Deschamps, 1970 | liquid phase; solvent: CCl4 |

References

Sauvaitre, 1972
Sauvaitre, H.,
Isomerisation de la benzaldoxime. III. Etude par spectrometrie infrarouge de l'influence des phenomenes d'association intermoleculaire sur l'equilibre entre les isomeres et sur leur cinetique de transformation,
J. Mol. Struct., 1972, 11, 403-421. [all data]
Sauvaitre and Deschamps, 1970
Sauvaitre, H.; Deschamps, J.,
Isomerisation de la benzaldoxime-I,
Tetrahedron, 1970, 26, 1647-1656. [all data]