Benzaldehyde, oxime, (E)-
- Formula: C7H7NO
- Molecular weight: 121.1366
- IUPAC Standard InChIKey: VTWKXBJHBHYJBI-UHFFFAOYSA-N
- CAS Registry Number: 622-31-1
- Chemical structure:
- Other names: (E)-Benzaldehyde oxime; (E)-Benzaldoxime; syn-Benzaldoxime; syn-Benzaldehyde oxime; Benzaldehyde oxime, trans

Phase change data

Data compiled by: Robert L. Brown and Stephen E. Stein
Quantity | Value | Units | Method | Reference | Comment |
---|---|---|---|---|---|
Tfus | 308. | K | N/A | Buckingham and Donaghy, 1982 |
Reduced pressure boiling point
Tboil (K) | Pressure (bar) | Reference |
---|---|---|
377.2 | 0.008 | Aldrich Chemical Company Inc., 1990 |
391. to 392. | 0.013 | Buckingham and Donaghy, 1982 |

References

Buckingham and Donaghy, 1982
Buckingham, J.; Donaghy, S.M.,
Dictionary of Organic Compounds: Fifth Edition, Chapman and Hall, New York, 1982, 1. [all data]
Aldrich Chemical Company Inc., 1990
Aldrich Chemical Company Inc.,
Catalog Handbook of Fine Chemicals, Aldrich Chemical Company, Inc., Milwaukee WI, 1990, 1. [all data]