CAS Reg. No. 62227-71-8
- CAS Registry Number: 62227-71-8

Reaction thermochemistry data

Data compiled by: John E. Bartmess
Individual Reactions
(CAS Reg. No. 62227-71-8 • 4294967295) +
= CAS Reg. No. 62227-71-8
By formula: (CAS Reg. No. 62227-71-8 • 4294967295CO) + CO = CAS Reg. No. 62227-71-8
Quantity | Value | Units | Method | Reference | Comment |
---|---|---|---|---|---|
ΔrH° | 24.90 | kcal/mol | Ther | Thynne and MacNeil, 1970 | gas phase; From CF2O |

References

Thynne and MacNeil, 1970
Thynne, J.C.J.; MacNeil, K.A.G.,
Ionisation and dissociation of carbonyl fluoride and trifluoromethyl hypofluorite by electron impact,
Intern. J. Mass Spectrom. Ion Phys., 1970, 5, 95. [all data]