Benzenamine, N,N'-methanetetraylbis-
- Formula: C13H10N2
- Molecular weight: 194.2319
- IUPAC Standard InChIKey: CMESPBFFDMPSIY-UHFFFAOYSA-N
- CAS Registry Number: 622-16-2
- Chemical structure:
View 3d structure (requires JavaScript / HTML 5) - Other names: Carbodiimide, diphenyl-; Diphenylcarbodiimide; N,N'-Diphenylcarbodiimide; 1,3-Diphenylcarbodiimide; N,N'-Methanetetraylbis(benzenamine); Carbodiimide; Stabilizer 2013-P

Condensed phase thermochemistry data

Data compiled as indicated in comments:
ALS - Hussein Y. Afeefy, Joel F. Liebman, and Stephen E. Stein
DH - Eugene S. Domalski and Elizabeth D. Hearing
Quantity | Value | Units | Method | Reference | Comment |
---|---|---|---|---|---|
ΔfH°liquid | 286.0 ± 3.7 | kJ/mol | Ccb | Lebedev, Bykova, et al., 1984 | ALS |
Quantity | Value | Units | Method | Reference | Comment |
ΔcH°liquid | -6830.8 ± 3.7 | kJ/mol | Ccb | Lebedev, Bykova, et al., 1984 | ALS |
Quantity | Value | Units | Method | Reference | Comment |
S°liquid | 330.0 | J/mol*K | N/A | Lebedev, Bykova, et al., 1984, 2 | DH |
Constant pressure heat capacity of liquid
Cp,liquid (J/mol*K) | Temperature (K) | Reference | Comment |
---|---|---|---|
304.6 | 298.15 | Lebedev, Bykova, et al., 1984, 2 | T = 13.8 to 330 K.; DH |

Phase change data

Data compiled as indicated in comments:
TRC - Thermodynamics Research Center, NIST Boulder Laboratories, Chris Muzny director
AC - William E. Acree, Jr., James S. Chickos
DH - Eugene S. Domalski and Elizabeth D. Hearing
Quantity | Value | Units | Method | Reference | Comment |
---|---|---|---|---|---|
Ttriple | 287.41 | K | N/A | Lebedev, Bykova, et al., 1984, 3 | Uncertainty assigned by TRC = 0.02 K; TRC |
Enthalpy of vaporization
ΔvapH (kJ/mol) | Temperature (K) | Method | Reference | Comment |
---|---|---|---|---|
65.6 | 515. | A,I | Stephenson and Malanowski, 1987 | Based on data from 500. to 599. K. See also Johns, McElhill, et al., 1962.; AC |
Enthalpy of fusion
ΔfusH (kJ/mol) | Temperature (K) | Reference | Comment |
---|---|---|---|
18.550 | 287.41 | Lebedev, Bykova, et al., 1984, 2 | DH |
18.55 | 287.4 | Domalski and Hearing, 1990 | AC |
Entropy of fusion
ΔfusS (J/mol*K) | Temperature (K) | Reference | Comment |
---|---|---|---|
64.54 | 287.41 | Lebedev, Bykova, et al., 1984, 2 | DH |

References

Lebedev, Bykova, et al., 1984
Lebedev, B.V.; Bykova, T.A.; Kiparisova, E.G.; Pankratov, V.A.; Korshak, V.V.; Laktionov, V.M.,
Thermodynamics and interconversion of diphenylcarbodiimide, hexaphenylisomelamine, and hexaphenylmelamine at 0-330 K,
J. Gen. Chem. USSR, 1984, 54, 372-378. [all data]
Lebedev, Bykova, et al., 1984, 2
Lebedev, B.V.; Bykova, T.A.; Kiparisova, Y.G.; Pankratov, V.A.; Korshak, V.V.; Laktionov, V.M.,
Thermodynamics and interconversion of diphenylcarbodiimide, hexaphenylisomelamine, and hexaphenylmelamine at 0-330 K,
Zhur. Obshch. Khim., 1984, 54(2), 417-424. [all data]
Lebedev, Bykova, et al., 1984, 3
Lebedev, B.V.; Bykova, T.A.; Kiparisova, E.G.; Pankratov, V.A.; Mitina, L.M.; Korshak, V.V.,
Thermodynamics of Benzonitrile, Its Cyclotrimerization and the Resulting Triphenyltriazine in the 0-330 K Range,
Zh. Obshch. Khim., 1984, 54, 1352. [all data]
Stephenson and Malanowski, 1987
Stephenson, Richard M.; Malanowski, Stanislaw,
Handbook of the Thermodynamics of Organic Compounds, 1987, https://doi.org/10.1007/978-94-009-3173-2
. [all data]
Johns, McElhill, et al., 1962
Johns, I.B.; McElhill, E.A.; Smith, J.O.,
Thermal Stability of Some Organic Compounds.,
J. Chem. Eng. Data, 1962, 7, 2, 277-281, https://doi.org/10.1021/je60013a036
. [all data]
Domalski and Hearing, 1990
Domalski, Eugene S.; Hearing, Elizabeth D.,
Heat Capacities and Entropies of Organic Compounds in the Condensed Phase Volume II,
J. Phys. Chem. Ref. Data, 1990, 19, 4, 881, https://doi.org/10.1063/1.555876
. [all data]