N,N'-Diphenylmethylenediamine
- Formula: C13H14N2
- Molecular weight: 198.2637
- IUPAC Standard InChIKey: OHQOKJPHNPUMLN-UHFFFAOYSA-N
- CAS Registry Number: 622-14-0
- Chemical structure:
View 3d structure (requires JavaScript / HTML 5) - Permanent link for this species. Use this link for bookmarking this species for future reference.

Condensed phase thermochemistry data

Data compiled by: Hussein Y. Afeefy, Joel F. Liebman, and Stephen E. Stein
Quantity | Value | Units | Method | Reference | Comment |
---|---|---|---|---|---|
ΔfH°solid | Ccb | Kishore and Santhanalakshmi, 1983 | uncertain value: 145.4 ± 0.63 kJ/mol; Data origin uncertain | ||
Quantity | Value | Units | Method | Reference | Comment |
ΔcH°solid | Ccb | Kishore and Santhanalakshmi, 1983 | uncertain value: -7091. ± 22. kJ/mol; Data origin uncertain |

Reaction thermochemistry data

Data compiled by: Hussein Y. Afeefy, Joel F. Liebman, and Stephen E. Stein
Individual Reactions
By formula: C13H14N2 = C13H14N2
Quantity | Value | Units | Method | Reference | Comment |
---|---|---|---|---|---|
ΔrH° | 60.310 ± 0.043 | kJ/mol | Kin | Santhanalakshmi, 1988 | liquid phase; solvent: Aqueous |

References

Kishore and Santhanalakshmi, 1983
Kishore, K.; Santhanalakshmi, K.N.,
A thermochemical approach to the analysis of aniline-formaldehyde reactions,
Thermochim. Acta, 1983, 64, 155-165. [all data]
Santhanalakshmi, 1988
Santhanalakshmi, J.,
A thermochemical kinetic study of interconversion reactions of aniline-formaldehyde products,
Thermochim. Acta, 1988, 127, 369-375. [all data]