2,6-dimethyl-3-(1-methylethyl)heptane

Phase change data

Data compiled by: Thermodynamics Research Center, NIST Boulder Laboratories, Chris Muzny director

Quantity Value Units Method Reference Comment
Tboil460.KN/AMurat and Amouroux, 1914Uncertainty assigned by TRC = 5. K

In addition to the Thermodynamics Research Center (TRC) data available from this site, much more physical and chemical property data is available from the following TRC products:

References

Murat and Amouroux, 1914
Murat, M.; Amouroux, G., Bull. Soc. Chim. Fr., 1914, 15, 159. [all data]