1,1,2-Trimethylcyclopenta-2-ene
- Formula: C8H14
- Molecular weight: 110.1968
- IUPAC Standard InChIKey: OHIIGLSGZTXTBM-UHFFFAOYSA-N
- CAS Registry Number: 62184-83-2
- Chemical structure:
View 3d structure (requires JavaScript / HTML 5) - Permanent link for this species. Use this link for bookmarking this species for future reference.

Condensed phase thermochemistry data

Data compiled by: Hussein Y. Afeefy, Joel F. Liebman, and Stephen E. Stein
Quantity | Value | Units | Method | Reference | Comment |
---|---|---|---|---|---|
ΔcH°liquid | -5033.4 | kJ/mol | Ccb | Zubova, 1901 | Corresponding ΔfHºliquid = -115. kJ/mol (simple calculation by NIST; no Washburn corrections) |

Phase change data

Data compiled by: Thermodynamics Research Center, NIST Boulder Laboratories, Chris Muzny director
Quantity | Value | Units | Method | Reference | Comment |
---|---|---|---|---|---|
Tboil | 380. | K | N/A | Plate and Savel'eva, 1952 | Uncertainty assigned by TRC = 5. K |
Tboil | 383.80 | K | N/A | Fenske, Braun, et al., 1947 | Uncertainty assigned by TRC = 0.2 K |
Tboil | 382.4 | K | N/A | Anonymous, 1945 | Uncertainty assigned by TRC = 0.4 K |
Quantity | Value | Units | Method | Reference | Comment |
Tfus | 156.37 | K | N/A | Anonymous, 1945 | Uncertainty assigned by TRC = 0.2 K |

References

Zubova, 1901
Zubova, P.,
Data about heat of combustion of compound cycle structure,
Zh. Fiz. Khim., 1901, 33, 708-722. [all data]
Plate and Savel'eva, 1952
Plate, A.F.; Savel'eva, R.I.,
Alkylation of 1-Methylcyclopenten by the Butlerov-El'tekov Method,
Dokl. Akad. Nauk SSSR, 1952, 82, 919. [all data]
Fenske, Braun, et al., 1947
Fenske, M.R.; Braun, W.G.; Wiegand, R.V.; Quiggle, D.; McCormick, R.H.; Rank, D.H.,
Raman Spectra of Hydrocarbons,
Anal. Chem., 1947, 19, 700. [all data]
Anonymous, 1945
Anonymous, R.,
, Sunbury Rep. No. 2777, Anglo-Iranian Oil Co. Ltd., 1945. [all data]