2-Propenamide, 3-phenyl-
- Formula: C9H9NO
- Molecular weight: 147.1739
- IUPAC Standard InChIKey: APEJMQOBVMLION-VOTSOKGWSA-N
- CAS Registry Number: 621-79-4
- Chemical structure:

Condensed phase thermochemistry data

Data compiled by: Hussein Y. Afeefy, Joel F. Liebman, and Stephen E. Stein
Quantity | Value | Units | Method | Reference | Comment |
---|---|---|---|---|---|
ΔfH°solid | -106.9 | kJ/mol | Ccb | Ciocazanu, Dogaru, et al., 1976 | |
Quantity | Value | Units | Method | Reference | Comment |
ΔcH°solid | -4720.60 | kJ/mol | Ccb | Ciocazanu, Dogaru, et al., 1976 |

References

Ciocazanu, Dogaru, et al., 1976
Ciocazanu, I.; Dogaru, V.; Zavoianu, D.,
Structure and reactivity of amides. Concerning the heats of combustion and formation of some unsaturated α, β amides derived from acetamide,
Rev. Chim. (Bucharest), 1976, 27, 4-6. [all data]