Decanoic acid, 1,2,3-propanetriyl ester
- Formula: C33H62O6
- Molecular weight: 554.8418
- IUPAC Standard InChIKey: LADGBHLMCUINGV-UHFFFAOYSA-N
- CAS Registry Number: 621-71-6
- Chemical structure:

Condensed phase thermochemistry data

Data compiled as indicated in comments:
DH - Eugene S. Domalski and Elizabeth D. Hearing
ALS - Hussein Y. Afeefy, Joel F. Liebman, and Stephen E. Stein
Quantity | Value | Units | Method | Reference | Comment |
---|---|---|---|---|---|
ΔcH°solid | -4747.00 ± 0.44 | kcal/mol | Ccb | Freedman, Bagby, et al., 1989 | Corresponding ΔfHºsolid = -474.45 kcal/mol (simple calculation by NIST; no Washburn corrections); ALS |
Constant pressure heat capacity of liquid
Cp,liquid (cal/mol*K) | Temperature (K) | Reference | Comment |
---|---|---|---|
265.1 | 313. | Phillips and Mattamal, 1976 | T = 313 to 388 K.; DH |

Phase change data

Data compiled as indicated in comments:
TRC - Thermodynamics Research Center, NIST Boulder Laboratories, Chris Muzny director
AC - William E. Acree, Jr., James S. Chickos
Quantity | Value | Units | Method | Reference | Comment |
---|---|---|---|---|---|
Ttriple | 291.2 | K | N/A | Ollivon and Perron, 1982 | Crystal phase 2 phase; Uncertainty assigned by TRC = 1. K; TRC |
Ttriple | 305.4 | K | N/A | Ollivon and Perron, 1982 | Crystal phase 1 phase; Uncertainty assigned by TRC = 1. K; TRC |
Ttriple | 263.6 | K | N/A | Ollivon and Perron, 1982 | Crystal phase 3 phase; Uncertainty assigned by TRC = 1. K; TRC |
Quantity | Value | Units | Method | Reference | Comment |
ΔvapH° | 37.0 ± 1.3 | kcal/mol | TGA | Kishore, Shobha, et al., 1990 | AC |
Enthalpy of vaporization
ΔvapH (kcal/mol) | Temperature (K) | Method | Reference | Comment |
---|---|---|---|---|
31.19 | 411. | TGA | Kishore, Shobha, et al., 1990 | AC |
29.78 | 452. | A | Stephenson and Malanowski, 1987 | Based on data from 437. to 485. K.; AC |

Van Den Dool and Kratz RI, non-polar column, custom temperature program

Column type | Active phase | I | Reference | Comment |
---|---|---|---|---|
Capillary | HP-5MS | 3503.9 | Andriamaharavo, 2014 | 30. m/0.25 mm/0.25 μm, He; Program: 60C (1 min) => 5 C/min => 210C => 10 C/min => 280C (15 min) |

References

Freedman, Bagby, et al., 1989
Freedman, B.; Bagby, M.O.; Khoury, H.,
Correlation of heats of combustion with empirical formulas for fatty alcohols,
J. Am. Oil Chem. Soc., 1989, 66, 595-596. [all data]
Phillips and Mattamal, 1976
Phillips, J.C.; Mattamal, M.M.,
Correlation of liquid heat capacities for carboxylic esters,
J. Chem. Eng. Data, 1976, 21, 228-232. [all data]
Ollivon and Perron, 1982
Ollivon, M.; Perron, R.,
Thermochim. Acta, 1982, 53, 183-194. [all data]
Kishore, Shobha, et al., 1990
Kishore, K.; Shobha, H.K.; Mattamal, G.J.,
Structural effects on the vaporization of high molecular weight esters,
J. Phys. Chem., 1990, 94, 4, 1642-1648, https://doi.org/10.1021/j100367a077
. [all data]
Stephenson and Malanowski, 1987
Stephenson, Richard M.; Malanowski, Stanislaw,
Handbook of the Thermodynamics of Organic Compounds, 1987, https://doi.org/10.1007/978-94-009-3173-2
. [all data]
Andriamaharavo, 2014
Andriamaharavo, N.R.,
Retention Data. NIST Mass Spectrometry Data Center., NIST Mass Spectrometry Data Center, 2014. [all data]