Ethane, 2-chloro-1,1-diethoxy-
- Formula: C6H13ClO2
- Molecular weight: 152.619
- IUPAC Standard InChIKey: OVXJWSYBABKZMD-UHFFFAOYSA-N
- CAS Registry Number: 621-62-5
- Chemical structure:
View 3d structure (requires JavaScript / HTML 5) - Other names: Acetaldehyde, chloro-, diethyl acetal; Chloroacetaldehyde diethyl acetal; Diethoxyethyl chloride; Monochloroacetaldehyde diethyl acetal; 2-Chloroacetaldehyde diethyl acetal; 1,1-Diethoxy-2-chloroethane; 2-Chloro-1,1-diethoxyethane; NSC 8436

Phase change data

Data compiled as indicated in comments:
BS - Robert L. Brown and Stephen E. Stein
TRC - Thermodynamics Research Center, NIST Boulder Laboratories, Chris Muzny director
Quantity | Value | Units | Method | Reference | Comment |
---|---|---|---|---|---|
Tboil | 430.6 | K | N/A | Weast and Grasselli, 1989 | BS |
Tboil | 430.6 | K | N/A | Lecat, 1927 | Uncertainty assigned by TRC = 0.5 K; TRC |
Tboil | 430.6 | K | N/A | Lecat, 1926 | Uncertainty assigned by TRC = 0.5 K; TRC |
Reduced pressure boiling point
Tboil (K) | Pressure (bar) | Reference | Comment |
---|---|---|---|
344.7 | 0.047 | Weast and Grasselli, 1989 | BS |

Kovats' RI, non-polar column, isothermal

Column type | Active phase | Temperature (C) | I | Reference | Comment |
---|---|---|---|---|---|
Packed | Silicon High Vacuum Grease (obsolete) | 90. | 930. | Jonas, Janák, et al., 1966 | H2 |

References

Weast and Grasselli, 1989
CRC Handbook of Data on Organic Compounds, 2nd Editon, Weast,R.C and Grasselli, J.G., ed(s)., CRC Press, Inc., Boca Raton, FL, 1989, 1. [all data]
Lecat, 1927
Lecat, M.,
New binary azeotropes: 6th list,
Ann. Soc. Sci. Bruxelles, Ser. B, 1927, 47, 63-71. [all data]
Lecat, 1926
Lecat, M.,
New binary azeotropes second list,
Recl. Trav. Chim. Pays-Bas, 1926, 45, 620-627. [all data]
Jonas, Janák, et al., 1966
Jonas, J.; Janák, J.; Kratochvíl, M.,
Structural investigations with the aid of Kovats retention index system on one (nonpolar) stationary phase,
J. Gas Chromatogr., 1966, 4, 9, 332-335, https://doi.org/10.1093/chromsci/4.9.332
. [all data]