Benzaldehyde, 3-hydroxy-4-methoxy-
- Formula: C8H8O3
- Molecular weight: 152.1473
- IUPAC Standard InChIKey: JVTZFYYHCGSXJV-UHFFFAOYSA-N
- CAS Registry Number: 621-59-0
- Chemical structure:
View 3d structure (requires JavaScript / HTML 5) - Other names: p-Anisaldehyde, 3-hydroxy-; Isovanillin; 3-Hydroxy-p-anisaldehyde; 3-Hydroxy-4-methoxybenzaldehyde; 5-Formylguaiacol; 3-Hydroxy-para-anisaldehyde; 3-Hydroxyanisaldehyde; Isovanilline; Oxy-3 methoxy-4 benzaldehyde

Condensed phase thermochemistry data

Data compiled by: Hussein Y. Afeefy, Joel F. Liebman, and Stephen E. Stein
Quantity | Value | Units | Method | Reference | Comment |
---|---|---|---|---|---|
ΔcH°solid | -3838.0 ± 5.9 | kJ/mol | Ccb | Manzoni-Ansidei and Storto, 1940 | Reanalyzed by Cox and Pilcher, 1970, Original value = -3842.7 kJ/mol; Corresponding ΔfHºsolid = -453.42 kJ/mol (simple calculation by NIST; no Washburn corrections) |

Phase change data

Data compiled by: Robert L. Brown and Stephen E. Stein
Reduced pressure boiling point
Tboil (K) | Pressure (bar) | Reference |
---|---|---|
452.2 | 0.020 | Weast and Grasselli, 1989 |

Van Den Dool and Kratz RI, non-polar column, custom temperature program

Column type | Active phase | I | Reference | Comment |
---|---|---|---|---|
Capillary | VF-5MS | 1468.6 | Tret'yakov, 2008 | 30. m/0.25 mm/0.25 μm, He; Program: Multi-step temperature program; T(initial)=60C; T(final)=270C |

Normal alkane RI, non-polar column, custom temperature program

Column type | Active phase | I | Reference | Comment |
---|---|---|---|---|
Capillary | HP-5 | 1401. | Zhao, Li, et al., 2008 | 30. m/0.25 mm/0.25 μm; Program: 40 0C (2 min) 5 0C/min -> 80 0C 7 oC/min -> 160 0C 9 0C/min -> 200 0C 20 0C/min -> 280 0C (10 min) |

References

Manzoni-Ansidei and Storto, 1940
Manzoni-Ansidei, R.; Storto, T.,
Experimentelle beitrage zum problem der chelatringbildung. IX. Thermochemische untersuchungen an einigen methoxybenzaldehyden,
Atti. R. Acad. Italia. Rend. Classe Sci. Fis. Mat. Nat., 1940, 1, 465. [all data]
Cox and Pilcher, 1970
Cox, J.D.; Pilcher, G.,
Thermochemistry of Organic and Organometallic Compounds, Academic Press, New York, 1970, 1-636. [all data]
Weast and Grasselli, 1989
CRC Handbook of Data on Organic Compounds, 2nd Editon, Weast,R.C and Grasselli, J.G., ed(s)., CRC Press, Inc., Boca Raton, FL, 1989, 1. [all data]
Tret'yakov, 2008
Tret'yakov, K.V.,
Retention Data. NIST Mass Spectrometry Data Center., NIST Mass Spectrometry Data Center, 2008. [all data]
Zhao, Li, et al., 2008
Zhao, Y.; Li, J.; Xu, Y.; Duan, H.; Fan, W.; Zhao, G.,
EXtraction, preparation and identification of volatile compounds in Changyu XO brandy,
Chinese J. Chromatogr., 2008, 26, 2, 212-222, https://doi.org/10.1016/S1872-2059(08)60014-0
. [all data]