1-Cyclohexyl-1-phenyldodecane
- Formula: C24H40
- Molecular weight: 328.5744
- CAS Registry Number: 62155-50-4

Phase change data

Data compiled as indicated in comments:
TRC - Thermodynamics Research Center, NIST Boulder Laboratories, Chris Muzny director
AC - William E. Acree, Jr., James S. Chickos
Quantity | Value | Units | Method | Reference | Comment |
---|---|---|---|---|---|
Ttriple | 275.84 | K | N/A | Karasharli and Strelkov, 1960 | Uncertainty assigned by TRC = 0.02 K; TRC |
Ttriple | 275.8 | K | N/A | Karasharli and Strelkov, 1960, 2 | Uncertainty assigned by TRC = 0.2 K; TRC |
Enthalpy of fusion
ΔfusH (kcal/mol) | Temperature (K) | Reference | Comment |
---|---|---|---|
8.411 | 275.8 | Domalski and Hearing, 1996 | AC |

References

Karasharli and Strelkov, 1960
Karasharli, K.A.; Strelkov, P.G.,
Thermodynamic investigations of 1,1-dicyclohexyldodecane, 1,1-diphenyldodecane, 1-phenyl-1-cyclohexyldodecane at low temp.,
Dokl. Akad. Nauk SSSR, 1960, 131, 568-9. [all data]
Karasharli and Strelkov, 1960, 2
Karasharli, K.A.; Strelkov, P.G.,
Thermodynamic properties of dicyclohexyldodecane,
Zh. Fiz. Khim., 1960, 34, 693. [all data]
Domalski and Hearing, 1996
Domalski, Eugene S.; Hearing, Elizabeth D.,
Heat Capacities and Entropies of Organic Compounds in the Condensed Phase. Volume III,
J. Phys. Chem. Ref. Data, 1996, 25, 1, 1, https://doi.org/10.1063/1.555985
. [all data]