4-Propyldiphenylmethane
- Formula: C16H18
- Molecular weight: 210.3141
- IUPAC Standard InChIKey: AMYBKFZXPHQUPP-UHFFFAOYSA-N
- CAS Registry Number: 62155-41-3
- Chemical structure:
View 3d structure (requires JavaScript / HTML 5) - Permanent link for this species. Use this link for bookmarking this species for future reference.

Condensed phase thermochemistry data

Data compiled by: Hussein Y. Afeefy, Joel F. Liebman, and Stephen E. Stein
Quantity | Value | Units | Method | Reference | Comment |
---|---|---|---|---|---|
ΔcH°liquid | -2120. | kcal/mol | Ccb | Lamneck and Wise, 1954 |

Phase change data

Data compiled by: Thermodynamics Research Center, NIST Boulder Laboratories, Chris Muzny director
Quantity | Value | Units | Method | Reference | Comment |
---|---|---|---|---|---|
Tboil | 584.27 | K | N/A | Lamneck, Hipsher, et al., 1954 | Uncertainty assigned by TRC = 0.3 K |
Tboil | 584.27 | K | N/A | Lamneck and Wise, 1954, 2 | Uncertainty assigned by TRC = 0.3 K |
Quantity | Value | Units | Method | Reference | Comment |
Tfus | 250.67 | K | N/A | Lamneck, Hipsher, et al., 1954 | Uncertainty assigned by TRC = 0.3 K |
Tfus | 250.67 | K | N/A | Lamneck and Wise, 1954, 2 | Uncertainty assigned by TRC = 0.2 K |

References

Lamneck and Wise, 1954
Lamneck, J.H., Jr.; Wise, P.H.,
Dicyclic hydrocarbons. X. Synthesis and physical properties of some propyl- and butyldiphenylmethanes and 4-isopropyldicyclohexylmethane,
J. Am. Chem. Soc., 1954, 76, 3475-3476. [all data]
Lamneck, Hipsher, et al., 1954
Lamneck, J.H.; Hipsher, H.F.; Fenn, V.O.,
, Natl. Advis. Comm. Aeronaut., 1954. [all data]
Lamneck and Wise, 1954, 2
Lamneck, J.H.; Wise, P.H.,
Dicyclic Hydrocarbons X. Synthesis and Physical Properties of SOme Propyl- and Butyldiphenylmethanes and 4-Isopropyldicyclohexylmethane,
J. Am. Chem. Soc., 1954, 76, 3475-6. [all data]