Benzeneacetonitrile, 3-nitro-
- Formula: C8H6N2O2
- Molecular weight: 162.1454
- IUPAC Standard InChIKey: WAVKEPUFQMUGBP-UHFFFAOYSA-N
- CAS Registry Number: 621-50-1
- Chemical structure:
View 3d structure (requires JavaScript / HTML 5) - Other names: Acetonitrile, (m-nitrophenyl)-; m-Nitro-phenylacetonitrile; m-Nitrobenzyl cyanide; 3-nitrophenylacetonitrile

Reaction thermochemistry data

Data compiled by: John E. Bartmess
Individual Reactions
C8H5N2O2- + =
By formula: C8H5N2O2- + H+ = C8H6N2O2
Quantity | Value | Units | Method | Reference | Comment |
---|---|---|---|---|---|
ΔrH° | 1412. ± 10. | kJ/mol | G+TS | Taft and Topsom, 1987 | gas phase |
Quantity | Value | Units | Method | Reference | Comment |
ΔrG° | 1384. ± 8.4 | kJ/mol | IMRE | Taft and Topsom, 1987 | gas phase |

Gas phase ion energetics data

Data compiled by: John E. Bartmess
De-protonation reactions
C8H5N2O2- + =
By formula: C8H5N2O2- + H+ = C8H6N2O2
Quantity | Value | Units | Method | Reference | Comment |
---|---|---|---|---|---|
ΔrH° | 1412. ± 10. | kJ/mol | G+TS | Taft and Topsom, 1987 | gas phase |
Quantity | Value | Units | Method | Reference | Comment |
ΔrG° | 1384. ± 8.4 | kJ/mol | IMRE | Taft and Topsom, 1987 | gas phase |

References

Taft and Topsom, 1987
Taft, R.W.; Topsom, R.D.,
The Nature and Analysis of Substituent Effects,
Prog. Phys. Org. Chem., 1987, 16, 1. [all data]