Phenol, 3-propyl-
- Formula: C9H12O
- Molecular weight: 136.1910
- IUPAC Standard InChIKey: MPWGZBWDLMDIHO-UHFFFAOYSA-N
- CAS Registry Number: 621-27-2
- Chemical structure:
View 3d structure (requires JavaScript / HTML 5) - Other names: Phenol, m-propyl-; m-Propylphenol; 3-n-Propylphenol; 3-Propylphenol; 1-Hydroxy-3-n-propylbenzene

Phase change data

Data compiled as indicated in comments:
TRC - Thermodynamics Research Center, NIST Boulder Laboratories, Chris Muzny director
AC - William E. Acree, Jr., James S. Chickos
Quantity | Value | Units | Method | Reference | Comment |
---|---|---|---|---|---|
Tboil | 501.15 | K | N/A | Karr, Estep, et al., 1961 | Uncertainty assigned by TRC = 3. K; TRC |
Tboil | 501.15 | K | N/A | Karr, 1957 | Uncertainty assigned by TRC = 3. K; TRC |
Tboil | 504.15 | K | N/A | White, 1954 | Uncertainty assigned by TRC = 3. K; TRC |
Tboil | 501.15 | K | N/A | Ciamician and Silber, 1890 | Uncertainty assigned by TRC = 3. K; TRC |
Quantity | Value | Units | Method | Reference | Comment |
Tfus | 299.15 | K | N/A | Karr, 1957 | Uncertainty assigned by TRC = 2. K; TRC |
Enthalpy of vaporization
ΔvapH (kJ/mol) | Temperature (K) | Method | Reference | Comment |
---|---|---|---|---|
60.2 | 423. | A | Stephenson and Malanowski, 1987 | Based on data from 408. to 538. K.; AC |
59.9 | 398. | N/A | Stage, Müller, et al., 1953 | Based on data from 386. to 512. K.; AC |
57.2 | 423. | N/A | Stage, Müller, et al., 1953 | Based on data from 386. to 512. K.; AC |
53.0 | 473. | N/A | Stage, Müller, et al., 1953 | Based on data from 386. to 512. K.; AC |

Kovats' RI, non-polar column, isothermal

View large format table.

Column type Active phase Temperature (C) I Reference Comment
CapillaryPS-255150.1236.Engewald, Billing, et al., 198850. m/0.30 mm/0.25 μm

Normal alkane RI, non-polar column, temperature ramp

View large format table.

Column type Active phase I Reference Comment
CapillaryDB-51285.Czerny, Brueckner, et al., 201130. m/0.32 mm/0.25 μm, Helium, 40. C @ 2. min, 8. K/min, 250. C @ 5. min

Normal alkane RI, polar column, temperature ramp

View large format table.

Column type Active phase I Reference Comment
CapillaryDB-FFAP2250.Czerny, Brueckner, et al., 201130. m/0.32 mm/0.25 μm, Helium, 40. C @ 2. min, 8. K/min, 230. C @ 5. min
CapillaryAT-Wax2246.Kiss, Csoka, et al., 201160. m/0.25 mm/0.25 μm, Helium, 4. K/min; Tstart: 60. C; Tend: 280. C

References

Karr, Estep, et al., 1961
Karr, C.; Estep, P.A.; Chang, T.-C.L.; Comberiati, H.R.,
, U. S. Bur. Mines, Bull. 591, 1961. [all data]
Karr, 1957
Karr, C.,
, U. S. Bur. Mines, Inform. Circ. IC 7802, 1957. [all data]
White, 1954
White, E.N.,
5th Tar Conf. Coal Tar Res. Assoc. Rept. 0124, 1954, England, 1954. [all data]
Ciamician and Silber, 1890
Ciamician, G.; Silber,
Chem. Ber., 1890, 23, 1159. [all data]
Stephenson and Malanowski, 1987
Stephenson, Richard M.; Malanowski, Stanislaw,
Handbook of the Thermodynamics of Organic Compounds, 1987, https://doi.org/10.1007/978-94-009-3173-2
. [all data]
Stage, Müller, et al., 1953
Stage, H.; Müller, E.; Faldix, P.,
Erdol u Kohle, 1953, 6, 375. [all data]