Butanoic acid, 4-chloro, 3-methylbutyl ester
- Formula: C9H17ClO2
- Molecular weight: 192.683
- IUPAC Standard InChIKey: AIQWYBIIHIAUKD-UHFFFAOYSA-N
- CAS Registry Number: 62108-80-9
- Chemical structure:
View 3d structure (requires JavaScript / HTML 5) - Other names: 4-Chlorobutyric acid, 3-methylbutyl ester; 3-Methylbutyl 4-chlorobutyrate

Gas phase thermochemistry data

Data compiled by: Hussein Y. Afeefy, Joel F. Liebman, and Stephen E. Stein
Quantity | Value | Units | Method | Reference | Comment |
---|---|---|---|---|---|
ΔfH°gas | -600.8 ± 9.6 | kJ/mol | Ccb | Smith, Bjellerup, et al., 1953 | Heat of formation derived by Cox and Pilcher, 1970 |

Condensed phase thermochemistry data

Data compiled by: Hussein Y. Afeefy, Joel F. Liebman, and Stephen E. Stein
Quantity | Value | Units | Method | Reference | Comment |
---|---|---|---|---|---|
ΔfH°liquid | -656.5 ± 8.4 | kJ/mol | Ccb | Smith, Bjellerup, et al., 1953 | Heat of formation derived by Cox and Pilcher, 1970 |
Quantity | Value | Units | Method | Reference | Comment |
ΔcH°liquid | -5338.4 ± 8.4 | kJ/mol | Ccb | Smith, Bjellerup, et al., 1953 | Reanalyzed by Cox and Pilcher, 1970, Original value = -5331.0 ± 4.2 kJ/mol; Heat of formation derived by Cox and Pilcher, 1970 |
ΔcH°liquid | -5327.9 | kJ/mol | Ccb | Schjanberg, 1935 |

Phase change data

Data compiled by: Hussein Y. Afeefy, Joel F. Liebman, and Stephen E. Stein
Quantity | Value | Units | Method | Reference | Comment |
---|---|---|---|---|---|
ΔvapH° | 55.6 ± 4.2 | kJ/mol | V | Smith, Bjellerup, et al., 1953 | Heat of formation derived by Cox and Pilcher, 1970 |

Kovats' RI, non-polar column, isothermal

Column type | Active phase | Temperature (C) | I | Reference | Comment |
---|---|---|---|---|---|
Capillary | SE-30 | 100. | 1253. | Haken, Madden, et al., 1985 | N2; Column length: 25. m; Column diameter: 0.33 mm |
Capillary | SE-30 | 120. | 1251. | Haken, Madden, et al., 1985 | N2; Column length: 25. m; Column diameter: 0.33 mm |
Capillary | SE-30 | 140. | 1274. | Haken, Madden, et al., 1985 | N2; Column length: 25. m; Column diameter: 0.33 mm |
Capillary | SE-30 | 60. | 1260. | Haken, Madden, et al., 1985 | N2; Column length: 25. m; Column diameter: 0.33 mm |
Capillary | SE-30 | 80. | 1256. | Haken, Madden, et al., 1985 | N2; Column length: 25. m; Column diameter: 0.33 mm |

Kovats' RI, polar column, isothermal

Column type | Active phase | Temperature (C) | I | Reference | Comment |
---|---|---|---|---|---|
Capillary | OV-351 | 100. | 1690. | Haken, Madden, et al., 1985 | N2; Column length: 25. m; Column diameter: 0.32 mm |
Capillary | OV-351 | 120. | 1706. | Haken, Madden, et al., 1985 | N2; Column length: 25. m; Column diameter: 0.32 mm |
Capillary | OV-351 | 60. | 1673. | Haken, Madden, et al., 1985 | N2; Column length: 25. m; Column diameter: 0.32 mm |
Capillary | OV-351 | 80. | 1680. | Haken, Madden, et al., 1985 | N2; Column length: 25. m; Column diameter: 0.32 mm |

Van Den Dool and Kratz RI, non-polar column, temperature ramp

Column type | Active phase | I | Reference | Comment |
---|---|---|---|---|
Capillary | 5 % Phenyl methyl siloxane | 1306. | Zaikin, 2009 | 30. m/0.25 mm/0.25 μm, 15. K/min, 270. C @ 15. min; Tstart: 60. C |

References

Smith, Bjellerup, et al., 1953
Smith, L.; Bjellerup, L.; Krook, S.; Westermark, H.,
Heats of combustion of organic chloro compounds determined by the "quartz wool" method,
Acta Chem. Scand., 1953, 7, 65. [all data]
Cox and Pilcher, 1970
Cox, J.D.; Pilcher, G.,
Thermochemistry of Organic and Organometallic Compounds, Academic Press, New York, 1970, 1-636. [all data]
Schjanberg, 1935
Schjanberg, E.,
Die Verbrennungswarmen und die Refraktionsdaten einiger chlorsubstituierter Fettsauren und Ester.,
Z. Phys. Chem. Abt. A, 1935, 172, 197-233. [all data]
Haken, Madden, et al., 1985
Haken, J.K.; Madden, B.G.; Korhonen, I.O.O.,
Gas chromatography of homologous esters. XXXI. Butanoyl and monochlorobutanoyl esters of lower saturated branched chain and unsaturated alcohols on SE-30 and OV-351 capillary columns,
J. Chromatogr., 1985, 325, 61-73, https://doi.org/10.1016/S0021-9673(00)96008-4
. [all data]
Zaikin, 2009
Zaikin, V.G.,
Personal Communication: Retention indices measured during the period 2008 to 2009, 2009. [all data]