Butyl 2-chlorobutyrate
- Formula: C8H15ClO2
- Molecular weight: 178.656
- IUPAC Standard InChIKey: NULLMNSLPQGSMJ-UHFFFAOYSA-N
- CAS Registry Number: 62108-74-1
- Chemical structure:

Gas phase thermochemistry data

Data compiled by: Hussein Y. Afeefy, Joel F. Liebman, and Stephen E. Stein
Quantity | Value | Units | Method | Reference | Comment |
---|---|---|---|---|---|
ΔfH°gas | -602.5 ± 9.6 | kJ/mol | Ccb | Smith, Bjellerup, et al., 1953 | Heat of formation derived by Cox and Pilcher, 1970 |

Phase change data

Data compiled by: Hussein Y. Afeefy, Joel F. Liebman, and Stephen E. Stein
Quantity | Value | Units | Method | Reference | Comment |
---|---|---|---|---|---|
ΔvapH° | 12.6 ± 1.0 | kcal/mol | V | Smith, Bjellerup, et al., 1953 | Heat of formation derived by Cox and Pilcher, 1970 |

Condensed phase thermochemistry data

Data compiled by: Hussein Y. Afeefy, Joel F. Liebman, and Stephen E. Stein

Quantity Value Units Method Reference Comment
Δfliquid-655.2 ± 8.4kJ/molCcbSmith, Bjellerup, et al., 1953Heat of formation derived by Cox and Pilcher, 1970
Quantity Value Units Method Reference Comment
Δcliquid-4660.1 ± 8.4kJ/molCcbSmith, Bjellerup, et al., 1953Reanalyzed by Cox and Pilcher, 1970, Original value = -4654. ± 8. kJ/mol; Heat of formation derived by Cox and Pilcher, 1970
Δcliquid-4651.4kJ/molCcbSchjanberg, 1935

References

Smith, Bjellerup, et al., 1953
Smith, L.; Bjellerup, L.; Krook, S.; Westermark, H.,
Heats of combustion of organic chloro compounds determined by the "quartz wool" method,
Acta Chem. Scand., 1953, 7, 65. [all data]
Cox and Pilcher, 1970
Cox, J.D.; Pilcher, G.,
Thermochemistry of Organic and Organometallic Compounds, Academic Press, New York, 1970, 1-636. [all data]