Propyl 3-chlorobutanoate
- Formula: C7H13ClO2
- Molecular weight: 164.630
- IUPAC Standard InChIKey: OPZLOOXQPPMSKG-UHFFFAOYSA-N
- CAS Registry Number: 62108-72-9
- Chemical structure:

Gas phase thermochemistry data

Data compiled by: Hussein Y. Afeefy, Joel F. Liebman, and Stephen E. Stein
Quantity | Value | Units | Method | Reference | Comment |
---|---|---|---|---|---|
ΔfH°gas | -128.6 ± 2.3 | kcal/mol | Ccb | Smith, Bjellerup, et al., 1953 | Heat of formation derived by Cox and Pilcher, 1970 |

Condensed phase thermochemistry data

Data compiled by: Hussein Y. Afeefy, Joel F. Liebman, and Stephen E. Stein
Quantity | Value | Units | Method | Reference | Comment |
---|---|---|---|---|---|
ΔfH°liquid | -141.1 ± 2.0 | kcal/mol | Ccb | Smith, Bjellerup, et al., 1953 | Heat of formation derived by Cox and Pilcher, 1970 |
Quantity | Value | Units | Method | Reference | Comment |
ΔcH°liquid | -967.0 ± 2.0 | kcal/mol | Ccb | Smith, Bjellerup, et al., 1953 | Reanalyzed by Cox and Pilcher, 1970, Original value = -965.8 ± 1.0 kcal/mol; Heat of formation derived by Cox and Pilcher, 1970 |
ΔcH°liquid | -965.3 | kcal/mol | Ccb | Schjanberg, 1935 |

Phase change data

Data compiled by: Hussein Y. Afeefy, Joel F. Liebman, and Stephen E. Stein
Quantity | Value | Units | Method | Reference | Comment |
---|---|---|---|---|---|
ΔvapH° | 12.5 ± 1.0 | kcal/mol | V | Smith, Bjellerup, et al., 1953 | Heat of formation derived by Cox and Pilcher, 1970 |

References

Smith, Bjellerup, et al., 1953
Smith, L.; Bjellerup, L.; Krook, S.; Westermark, H.,
Heats of combustion of organic chloro compounds determined by the "quartz wool" method,
Acta Chem. Scand., 1953, 7, 65. [all data]
Cox and Pilcher, 1970
Cox, J.D.; Pilcher, G.,
Thermochemistry of Organic and Organometallic Compounds, Academic Press, New York, 1970, 1-636. [all data]
Schjanberg, 1935
Schjanberg, E.,
Die Verbrennungswarmen und die Refraktionsdaten einiger chlorsubstituierter Fettsauren und Ester.,
Z. Phys. Chem. Abt. A, 1935, 172, 197-233. [all data]