Propanoic acid, 3-chloro-, propyl ester
- Formula: C6H11ClO2
- Molecular weight: 150.603
- IUPAC Standard InChIKey: WIOAODPBBXZVNV-UHFFFAOYSA-N
- CAS Registry Number: 62108-66-1
- Chemical structure:

Gas phase thermochemistry data

Data compiled by: Hussein Y. Afeefy, Joel F. Liebman, and Stephen E. Stein
Quantity | Value | Units | Method | Reference | Comment |
---|---|---|---|---|---|
ΔfH°gas | -116.1 ± 2.3 | kcal/mol | Ccb | Smith, Bjellerup, et al., 1953 | Heat of formation derived by Cox and Pilcher, 1970 |

Kovats' RI, non-polar column, isothermal

Data compiled by: NIST Mass Spectrometry Data Center, William E. Wallace, director

Column type CapillaryCapillaryCapillaryCapillaryCapillary
Active phase SE-30SE-30SE-30SE-30SE-30
Column length (m) 25.25.25.25.25.
Carrier gas
Substrate
Column diameter (mm) 0.330.330.330.330.33
Phase thickness (μm)
Temperature (C) 100.120.140.160.180.
I 996.996.978.985.986.
ReferenceHaken and Korhonen, 1985Haken and Korhonen, 1985Haken and Korhonen, 1985Haken and Korhonen, 1985Haken and Korhonen, 1985
Comment MSDC-RI MSDC-RI MSDC-RI MSDC-RI MSDC-RI
Column type CapillaryCapillaryCapillary
Active phase SE-30OV-101OV-101
Column length (m) 25.19.15.
Carrier gas  N2
Substrate
Column diameter (mm) 0.330.280.22
Phase thickness (μm)
Temperature (C) 80.100.80.
I 1003.1000.998.
ReferenceHaken and Korhonen, 1985Horna, Táborský, et al., 1985Komárek, Hornová, et al., 1983
Comment MSDC-RI MSDC-RI MSDC-RI

Condensed phase thermochemistry data

Data compiled by: Hussein Y. Afeefy, Joel F. Liebman, and Stephen E. Stein

Quantity Value Units Method Reference Comment
Δfliquid-537.6 ± 8.4kJ/molCcbSmith, Bjellerup, et al., 1953Heat of formation derived by Cox and Pilcher, 1970
Quantity Value Units Method Reference Comment
Δcliquid-3419.2 ± 8.4kJ/molCcbSmith, Bjellerup, et al., 1953Reanalyzed by Cox and Pilcher, 1970, Original value = -3478.7 ± 4.2 kJ/mol; Heat of formation derived by Cox and Pilcher, 1970
Δcliquid-3479. ± 4.kJ/molCcbSmith, Bjellerup, et al., 1953
Δcliquid-3413.kJ/molCcbSchjanberg, 1935

Phase change data

Data compiled by: Hussein Y. Afeefy, Joel F. Liebman, and Stephen E. Stein

Quantity Value Units Method Reference Comment
Δvap12.4 ± 1.0kcal/molESmith, Bjellerup, et al., 1953Heat of formation derived by Cox and Pilcher, 1970

References

Smith, Bjellerup, et al., 1953
Smith, L.; Bjellerup, L.; Krook, S.; Westermark, H.,
Heats of combustion of organic chloro compounds determined by the "quartz wool" method,
Acta Chem. Scand., 1953, 7, 65. [all data]
Cox and Pilcher, 1970
Cox, J.D.; Pilcher, G.,
Thermochemistry of Organic and Organometallic Compounds, Academic Press, New York, 1970, 1-636. [all data]