1-Bromotricosane

Phase change data

Data compiled by: William E. Acree, Jr., James S. Chickos

Enthalpy of fusion

ΔfusH (kJ/mol) Temperature (K) Reference
79.5339.6Hoffman and Decker, 1953

References

Hoffman and Decker, 1953
Hoffman, John D.; Decker, Beulah F., Solid State Phase Changes in Long Chain Compounds, J. Phys. Chem., 1953, 57, 5, 520-529, https://doi.org/10.1021/j150506a009 . [all data]