Pentane, 2-methoxy-2,4,4-trimethyl-
- Formula: C9H20O
- Molecular weight: 144.2545
- IUPAC Standard InChIKey: IKZVAPMTXDXWMX-UHFFFAOYSA-N
- CAS Registry Number: 62108-41-2
- Chemical structure:
View 3d structure (requires JavaScript / HTML 5) - Other names: Methyl 1,1,3,3-tetramethylbutyl ether; Methyl tert-octyl ether; 2-Methoxy-2,4,4-trimethylpentane

Phase change data

Data compiled by: William E. Acree, Jr., James S. Chickos
Quantity | Value | Units | Method | Reference | Comment |
---|---|---|---|---|---|
ΔvapH° | 45.3 | kJ/mol | N/A | Verevkin, 2002 | See also Verevkin, Krasnykh, et al., 2003. |
ΔvapH° | 45.33 | kJ/mol | EB | Uusi-Kyyny, Pokki, et al., 2001 | See also Verevkin, Krasnykh, et al., 2003. |
Enthalpy of vaporization
ΔvapH (kJ/mol) | Temperature (K) | Reference | Comment |
---|---|---|---|
38.5 | 396. | Uusi-Kyyny, Pokki, et al., 2001 | Based on data from 381. to 418. K. |

Normal alkane RI, non-polar column, isothermal

Column type | Active phase | Temperature (C) | I | Reference | Comment |
---|---|---|---|---|---|
Capillary | DB-5 | 120. | 897. | Verevkin, Krasnykh, et al., 2003 | 60. m/0.32 mm/0.25 μm, Nitrogen |

References

Verevkin, 2002
Verevkin, Sergey P.,
Improved Benson Increments for the Estimation of Standard Enthalpies of Formation and Enthalpies of Vaporization of Alkyl Ethers, Acetals, Ketals, and Ortho Esters,
J. Chem. Eng. Data, 2002, 47, 5, 1071-1097, https://doi.org/10.1021/je020023o
. [all data]
Verevkin, Krasnykh, et al., 2003
Verevkin, Sergey P.; Krasnykh, Eugen L.; Vasiltsova, Tatiana V.; Heintz, Andreas,
Determination of Ambient Temperature Vapor Pressures and Vaporization Enthalpies of Branched Ethers,
J. Chem. Eng. Data, 2003, 48, 3, 591-599, https://doi.org/10.1021/je0255980
. [all data]
Uusi-Kyyny, Pokki, et al., 2001
Uusi-Kyyny, Petri; Pokki, Juha-Pekka; Aittamaa, Juhani; Liukkonen, Simo,
Vapor-Liquid Equilibrium for the Binary Systems of Methanol + 2,4,4-Trimethyl-1-pentene at 331 K and 101 kPa and Methanol + 2-Methoxy-2,4,4-trimethylpentane at 333 K,
J. Chem. Eng. Data, 2001, 46, 5, 1244-1248, https://doi.org/10.1021/je010076q
. [all data]