Pyridine, 3-(phenylmethyl)-
- Formula: C12H11N
- Molecular weight: 169.2224
- IUPAC Standard InChIKey: UUCLVSDUMKMBSM-UHFFFAOYSA-N
- CAS Registry Number: 620-95-1
- Chemical structure:
View 3d structure (requires JavaScript / HTML 5) - Other names: 3-Benzylpyridine; Pyridine, 3-benzyl-

Phase change data

Data compiled by: Robert L. Brown and Stephen E. Stein
Quantity | Value | Units | Method | Reference | Comment |
---|---|---|---|---|---|
Tboil | 560.7 | K | N/A | Aldrich Chemical Company Inc., 1990 | |
Quantity | Value | Units | Method | Reference | Comment |
Tfus | 307. | K | N/A | Buckingham and Donaghy, 1982 |
Reduced pressure boiling point
Tboil (K) | Pressure (bar) | Reference |
---|---|---|
559.2 | 0.987 | Weast and Grasselli, 1989 |
559. | 0.987 | Buckingham and Donaghy, 1982 |

Normal alkane RI, non-polar column, temperature ramp

Column type | Active phase | I | Reference | Comment |
---|---|---|---|---|
Capillary | DB-1 | 1497. | Ishihara, Tsuneya, et al., 1992 | 60. m/0.25 mm/0.25 μm, He, 50. C @ 5. min, 3. K/min; Tend: 240. C |
Capillary | DB-1 | 1500. | Ishihara, Tsuneya, et al., 1992 | 60. m/0.25 mm/0.25 μm, He, 50. C @ 5. min, 3. K/min; Tend: 240. C |

References

Aldrich Chemical Company Inc., 1990
Aldrich Chemical Company Inc.,
Catalog Handbook of Fine Chemicals, Aldrich Chemical Company, Inc., Milwaukee WI, 1990, 1. [all data]
Buckingham and Donaghy, 1982
Buckingham, J.; Donaghy, S.M.,
Dictionary of Organic Compounds: Fifth Edition, Chapman and Hall, New York, 1982, 1. [all data]
Weast and Grasselli, 1989
CRC Handbook of Data on Organic Compounds, 2nd Editon, Weast,R.C and Grasselli, J.G., ed(s)., CRC Press, Inc., Boca Raton, FL, 1989, 1. [all data]
Ishihara, Tsuneya, et al., 1992
Ishihara, M.; Tsuneya, T.; Shiga, M.; Kawashima, S.; Yamagishi, K.; Yoshida, F.; Sato, H.; Uneyama, K.,
New pyridine derivatives and basic components in spearmint oil (Mentha gentilis f. cardiaca) and peppermint oil (Mentha piperita),
J. Agric. Food Chem., 1992, 40, 9, 1647-1655, https://doi.org/10.1021/jf00021a034
. [all data]