Benzenamine, 4-methyl-N-phenyl-
- Formula: C13H13N
- Molecular weight: 183.2490
- IUPAC Standard InChIKey: AGHYMXKKEXDUTA-UHFFFAOYSA-N
- CAS Registry Number: 620-84-8
- Chemical structure:
View 3d structure (requires JavaScript / HTML 5) - Other names: N-phenyl-p-toluidine

Condensed phase thermochemistry data

Data compiled by: Hussein Y. Afeefy, Joel F. Liebman, and Stephen E. Stein
Quantity | Value | Units | Method | Reference | Comment |
---|---|---|---|---|---|
ΔfH°solid | 11.7 ± 1.7 | kcal/mol | Ccb | Tavernier and Lamouroux, 1956 | Reanalyzed by Pedley, Naylor, et al., 1986, Original value = 14.57 kcal/mol |
Quantity | Value | Units | Method | Reference | Comment |
ΔcH°solid | -1679.4 ± 1.7 | kcal/mol | Ccb | Tavernier and Lamouroux, 1956 | Reanalyzed by Pedley, Naylor, et al., 1986, Original value = -1681.3 ± 1.7 kcal/mol |

References

Tavernier and Lamouroux, 1956
Tavernier, P.; Lamouroux, M.,
Determinations calorimetriques relatives a vingt-six substances organiques,
Mem. Poudres, 1956, 38, 65-88. [all data]
Pedley, Naylor, et al., 1986
Pedley, J.B.; Naylor, R.D.; Kirby, S.P.,
Thermochemical Data of Organic Compounds, Chapman and Hall, New York, 1986, 1-792. [all data]