Benzene, 1-methyl-4-(phenylmethyl)-
- Formula: C14H14
- Molecular weight: 182.2610
- IUPAC Standard InChIKey: SIYISNUJKMAQBV-UHFFFAOYSA-N
- CAS Registry Number: 620-83-7
- Chemical structure:
View 3d structure (requires JavaScript / HTML 5) - Other names: Methane, phenyl-p-tolyl-; (4-Methylphenyl)phenylmethane; p-Benzyltoluene; p-Tolylphenylmethane; Phenyl-p-tolylmethane; 4-Benzyltoluene; 4-Methyldiphenylmethane; 1-Methyl-4-benzylbenzene; 4'-Methyldiphenylmethane; 1-Methyl-4-(phenylmethyl)benzene

Condensed phase thermochemistry data

Data compiled by: Hussein Y. Afeefy, Joel F. Liebman, and Stephen E. Stein
Quantity | Value | Units | Method | Reference | Comment |
---|---|---|---|---|---|
ΔfH°liquid | 61.5 ± 1.2 | kJ/mol | Ccb | Good and Lee, 1976 | |
Quantity | Value | Units | Method | Reference | Comment |
ΔcH°liquid | -7571.5 ± 1.0 | kJ/mol | Ccb | Good and Lee, 1976 | Corresponding ΔfHºliquid = 61.55 kJ/mol (simple calculation by NIST; no Washburn corrections) |
ΔcH°liquid | -7301. | kJ/mol | Ccb | Lamneck and Wise, 1954 | Corresponding ΔfHºliquid = -210. kJ/mol (simple calculation by NIST; no Washburn corrections) |

Phase change data

Data compiled as indicated in comments:
TRC - Thermodynamics Research Center, NIST Boulder Laboratories, Chris Muzny director
AC - William E. Acree, Jr., James S. Chickos
Quantity | Value | Units | Method | Reference | Comment |
---|---|---|---|---|---|
Tboil | 551. ± 5. | K | AVG | N/A | Average of 6 values; Individual data points |
Quantity | Value | Units | Method | Reference | Comment |
Tfus | 277.73 | K | N/A | Lamneck and Wise, 1954, 2 | Uncertainty assigned by TRC = 0.2 K; TRC |
Quantity | Value | Units | Method | Reference | Comment |
ΔvapH° | 69.5 ± 0.3 | kJ/mol | GS | Verevkin, 1999 | Based on data from 293. to 333. K.; AC |
Enthalpy of vaporization
ΔvapH (kJ/mol) | Temperature (K) | Method | Reference | Comment |
---|---|---|---|---|
68.6 ± 0.3 | 313. | GS | Verevkin, 1999 | Based on data from 293. to 333. K.; AC |

Kovats' RI, non-polar column, isothermal

Column type | Active phase | Temperature (C) | I | Reference | Comment |
---|---|---|---|---|---|
Packed | Apiezon L | 170. | 1582. | Kríz, Popl, et al., 1974 | |
Packed | Apiezon L | 185. | 1594. | Kríz, Popl, et al., 1974 |

Kovats' RI, polar column, isothermal

Column type | Active phase | Temperature (C) | I | Reference | Comment |
---|---|---|---|---|---|
Capillary | SP-1000 | 185. | 2185. | Kríz, Popl, et al., 1974 | N2; Column length: 50. m; Column diameter: 0.25 mm |
Capillary | SP-1000 | 200. | 2144. | Kríz, Popl, et al., 1974 | N2; Column length: 50. m; Column diameter: 0.25 mm |

References

Good and Lee, 1976
Good, W.D.; Lee, S.H.,
The enthalpies of formation of selected naphthalenes, diphenylmethanes, and bicyclic hydrocarbons,
J. Chem. Thermodyn., 1976, 8, 643-650. [all data]
Lamneck and Wise, 1954
Lamneck, J.H., Jr.; Wise, P.H.,
Dicyclic hydrocarbons. IX. Synthesis and physical properties of the monomethyldiphenylmethanes and monomethyldicyclohexylmethanes,
J. Am. Chem. Soc., 1954, 76, 1104-1106. [all data]
Lamneck and Wise, 1954, 2
Lamneck, J.H.; Wise, P.H.,
Dicyclic hydrocarbons. IX. Synthesis and physical properties of the monomethyldiphenylmethanes and monomethyldicyclohexylmethanes,
J. Am. Chem. Soc., 1954, 76, 1104. [all data]
Verevkin, 1999
Verevkin, Sergey P.,
Thermochemical Properties of Diphenylalkanes,
J. Chem. Eng. Data, 1999, 44, 2, 175-179, https://doi.org/10.1021/je980200e
. [all data]
Kusakov, et al., 1963
Kusakov, M.M., et al.,
Ultraviolet Absorption Spectra of Aromatic Hydrocarbons, 1963, 221. [all data]
Kríz, Popl, et al., 1974
Kríz, J.; Popl, M.; Mostecký, J.,
Retention indices of biphenyls and diphenylalkanes,
J. Chromatogr., 1974, 97, 1, 3-13, https://doi.org/10.1016/S0021-9673(01)97577-6
. [all data]