HFS
- Formula: FHS
- Molecular weight: 52.071
- CAS Registry Number: 62064-82-8

Reaction thermochemistry data

Data compiled by: John E. Bartmess
Individual Reactions
FS- + = HFS
Quantity | Value | Units | Method | Reference | Comment |
---|---|---|---|---|---|
ΔrH° | 346.3 ± 3.5 | kcal/mol | D-EA | Polak, Gilles, et al., 1992 | gas phase |

Gas phase ion energetics data

Data compiled by: John E. Bartmess
De-protonation reactions
FS- + = HFS
Quantity | Value | Units | Method | Reference | Comment |
---|---|---|---|---|---|
ΔrH° | 346.3 ± 3.5 | kcal/mol | D-EA | Polak, Gilles, et al., 1992 | gas phase |

References

Polak, Gilles, et al., 1992
Polak, M.L.; Gilles, M.K.; Lineberger, W.C.,
Photoelectron Spectroscopy of SF-,
J. Chem. Phys., 1992, 96, 9, 7191, https://doi.org/10.1063/1.462526
. [all data]