Benzene, 1-methyl-3-(phenylmethyl)-
- Formula: C14H14
- Molecular weight: 182.2610
- IUPAC Standard InChIKey: KSYQGOYOIKQFNA-UHFFFAOYSA-N
- CAS Registry Number: 620-47-3
- Chemical structure:
View 3d structure (requires JavaScript / HTML 5) - Other names: Diphenylmethane, 3-methyl; 3-Methyldiphenylmethane

Condensed phase thermochemistry data

Data compiled by: Hussein Y. Afeefy, Joel F. Liebman, and Stephen E. Stein
Quantity | Value | Units | Method | Reference | Comment |
---|---|---|---|---|---|
ΔcH°liquid | -7322. | kJ/mol | Ccb | Lamneck and Wise, 1954 | Corresponding ΔfHºliquid = -190. kJ/mol (simple calculation by NIST; no Washburn corrections) |

Phase change data

Data compiled by: Thermodynamics Research Center, NIST Boulder Laboratories, Chris Muzny director
Quantity | Value | Units | Method | Reference | Comment |
---|---|---|---|---|---|
Tboil | 552.39 | K | N/A | Lamneck and Wise, 1954, 2 | Uncertainty assigned by TRC = 0.4 K |
Tboil | 552.39 | K | N/A | Lamneck and Wise, 1950 | Uncertainty assigned by TRC = 0.3 K |
Quantity | Value | Units | Method | Reference | Comment |
Tfus | 245.32 | K | N/A | Lamneck and Wise, 1954, 2 | Uncertainty assigned by TRC = 0.05 K |

Kovats' RI, non-polar column, isothermal

Column type | Active phase | Temperature (C) | I | Reference | Comment |
---|---|---|---|---|---|
Packed | Apiezon L | 170. | 1565. | Kríz, Popl, et al., 1974 | |
Packed | Apiezon L | 185. | 1576. | Kríz, Popl, et al., 1974 |

Kovats' RI, polar column, isothermal

Column type | Active phase | Temperature (C) | I | Reference | Comment |
---|---|---|---|---|---|
Capillary | SP-1000 | 185. | 2168. | Kríz, Popl, et al., 1974 | N2; Column length: 50. m; Column diameter: 0.25 mm |
Capillary | SP-1000 | 200. | 2128. | Kríz, Popl, et al., 1974 | N2; Column length: 50. m; Column diameter: 0.25 mm |

References

Lamneck and Wise, 1954
Lamneck, J.H., Jr.; Wise, P.H.,
Dicyclic hydrocarbons. IX. Synthesis and physical properties of the monomethyldiphenylmethanes and monomethyldicyclohexylmethanes,
J. Am. Chem. Soc., 1954, 76, 1104-1106. [all data]
Lamneck and Wise, 1954, 2
Lamneck, J.H.; Wise, P.H.,
Dicyclic hydrocarbons. IX. Synthesis and physical properties of the monomethyldiphenylmethanes and monomethyldicyclohexylmethanes,
J. Am. Chem. Soc., 1954, 76, 1104. [all data]
Lamneck and Wise, 1950
Lamneck, J.H.; Wise, P.H.,
, Natl. Advis. Comm. Aeronaut., Tech. Notes, No. 2230, Lewis Flight Propulsion Lab., Cleveland, OH, 1950. [all data]
Kríz, Popl, et al., 1974
Kríz, J.; Popl, M.; Mostecký, J.,
Retention indices of biphenyls and diphenylalkanes,
J. Chromatogr., 1974, 97, 1, 3-13, https://doi.org/10.1016/S0021-9673(01)97577-6
. [all data]