2,2-Dimethoxy-3,3-dimethyl-butane
- Formula: C8H18O2
- Molecular weight: 146.2273
- IUPAC Standard InChIKey: CXWNXMDAAYSVIV-UHFFFAOYSA-N
- CAS Registry Number: 62038-48-6
- Chemical structure:
View 3d structure (requires JavaScript / HTML 5) - Permanent link for this species. Use this link for bookmarking this species for future reference.

Reaction thermochemistry data

Data compiled by: Hussein Y. Afeefy, Joel F. Liebman, and Stephen E. Stein
Individual Reactions
By formula: C8H18O2 + H2O = 2CH4O + C6H12O
Quantity | Value | Units | Method | Reference | Comment |
---|---|---|---|---|---|
ΔrH° | 0.819 ± 0.013 | kcal/mol | Cm | Wiberg and Squires, 1979 | liquid phase; Heat of hydrolysis |

References

Wiberg and Squires, 1979
Wiberg, K.B.; Squires, R.R.,
Thermodynamics of hydrolysis aliphatic ketals. An entropy component of steric effects,
J. Am. Chem. Soc., 1979, 101, 5512-5515. [all data]