Benzyl sulfone
- Formula: C14H14O2S
- Molecular weight: 246.325
- IUPAC Standard InChIKey: AWHNUHMUCGRKRA-UHFFFAOYSA-N
- CAS Registry Number: 620-32-6
- Chemical structure:
View 3d structure (requires JavaScript / HTML 5) - Other names: Dibenzyl sulfone; Benzene, 1,1'-[sulfonylbis(methylene)]bis-; Dibenzyl sulphone

Gas phase thermochemistry data

Data compiled by: Hussein Y. Afeefy, Joel F. Liebman, and Stephen E. Stein
Quantity | Value | Units | Method | Reference | Comment |
---|---|---|---|---|---|
ΔfH°gas | -157.1 ± 3.2 | kJ/mol | Ccr | Mackle and O'Hare, 1961 | Reanalyzed by Cox and Pilcher, 1970, Original value = -151. ± 3. kJ/mol; Haet of combustion corrected for pressure |

Condensed phase thermochemistry data

Data compiled by: Hussein Y. Afeefy, Joel F. Liebman, and Stephen E. Stein
Quantity | Value | Units | Method | Reference | Comment |
---|---|---|---|---|---|
ΔfH°solid | -282.6 ± 1.2 | kJ/mol | Ccr | Mackle and O'Hare, 1961 | Reanalyzed by Cox and Pilcher, 1970, Original value = -265. ± 0.8 kJ/mol; Haet of combustion corrected for pressure |
Quantity | Value | Units | Method | Reference | Comment |
ΔcH°solid | -7829.6 ± 1.0 | kJ/mol | Ccr | Mackle and O'Hare, 1961 | Reanalyzed by Cox and Pilcher, 1970, Original value = -7847.3 ± 0.2 kJ/mol; Haet of combustion corrected for pressure |

Phase change data

Data compiled as indicated in comments:
TRC - Thermodynamics Research Center, NIST Boulder Laboratories, Chris Muzny director
ALS - Hussein Y. Afeefy, Joel F. Liebman, and Stephen E. Stein
Quantity | Value | Units | Method | Reference | Comment |
---|---|---|---|---|---|
Tfus | 422.7 | K | N/A | Kaldor and Hammond, 1991 | Uncertainty assigned by TRC = 1. K; TRC |
Tfus | 425. | K | N/A | Jarvis, Hoey, et al., 1988 | Uncertainty assigned by TRC = 3. K; TRC |
Tfus | 402. | K | N/A | Olah and Gupta, 1983 | Uncertainty assigned by TRC = 2. K; TRC |
Tfus | 425. | K | N/A | Boehme and Sitorus, 1972 | Uncertainty assigned by TRC = 3. K; TRC |
Quantity | Value | Units | Method | Reference | Comment |
ΔsubH° | 114. ± 2. | kJ/mol | V | Mackle and O'Hare, 1961 | Haet of combustion corrected for pressure; ALS |

References

Mackle and O'Hare, 1961
Mackle, H.; O'Hare, P.A.G.,
Studies in the thermochemistry of sulphones. Part 6 - Heats of combustion, fusion, vaporization and atomization of six aromatic and two allylic sulphones,
Trans. Faraday Soc., 1961, 57, 1521-1526. [all data]
Cox and Pilcher, 1970
Cox, J.D.; Pilcher, G.,
Thermochemistry of Organic and Organometallic Compounds, Academic Press, New York, 1970, 1-636. [all data]
Kaldor and Hammond, 1991
Kaldor, S.W.; Hammond, M.,
A Mild Osmium Tetraoxide-Catalyzed Method for the Oxidation of Sulfides to Sulfones,
Tetrahedron Lett., 1991, 32, 5043-6. [all data]
Jarvis, Hoey, et al., 1988
Jarvis, W.T.; Hoey, M.D.; Finocchio, A.L.; Dittmar, D.C.,
Organic reactions of Reduced Species of Sulfur Dioxide,
J. Org. Chem., 1988, 53, 5750-6. [all data]
Olah and Gupta, 1983
Olah, G.A.; Gupta, B.G.B.,
Onium Ions 27. Oxidation of Sulfoxides to Sulfones with Nitronium Salts,
J. Org. Chem., 1983, 48, 3585-7. [all data]
Boehme and Sitorus, 1972
Boehme, V.H.; Sitorus, U.,
Oxidation of Thioethers to Sulfones with Hydrogen Peroxide in Alkaline Solution,
Chem.-Ztg., 1972, 96, 37-8. [all data]
Fehnel and Carmack, 1949
Fehnel, E.A.; Carmack, M.,
J. Am. Chem. Soc., 1949, 71, 231. [all data]